Warning: Permanently added '172.25.95.132' (ECDSA) to the list of known hosts.
Running: /usr/bin/copr-rpmbuild --verbose --drop-resultdir --build-id 838767 --chroot fedora-rawhide-x86_64 --detached default
Version: 0.22
Task:
{'build_id': 838767,
 'buildroot_pkgs': [],
 'chroot': 'fedora-rawhide-x86_64',
 'enable_net': False,
 'fetch_sources_only': True,
 'git_hash': '6e47ec25c10a2f015af4973029edd65453fc56ab',
 'git_repo': 'sasiddiq/missioncontrol/javamail',
 'memory_reqs': 2048,
 'package_name': 'javamail',
 'package_version': '1.6.3-3.fc29',
 'project_dirname': 'missioncontrol',
 'project_name': 'missioncontrol',
 'project_owner': 'sasiddiq',
 'repos': [{'id': 'copr_base',
            'name': 'Copr repository',
            'url': 'https://copr-be.cloud.fedoraproject.org/results/sasiddiq/missioncontrol/fedora-rawhide-x86_64/'}],
 'source_json': {'clone_url': 'https://copr-dist-git.fedorainfracloud.org/git/sasiddiq/missioncontrol/javamail.git',
                 'committish': '6e47ec25c10a2f015af4973029edd65453fc56ab'},
 'source_type': 8,
 'submitter': 'sasiddiq',
 'task_id': '838767-fedora-rawhide-x86_64',
 'timeout': 64800,
 'use_bootstrap_container': False,
 'with_opts': [],
 'without_opts': []}

Running: git clone https://copr-dist-git.fedorainfracloud.org/git/sasiddiq/missioncontrol/javamail.git /tmp/tmptdzt90xa/javamail --depth 500 --no-single-branch

cmd: ['git', 'clone', 'https://copr-dist-git.fedorainfracloud.org/git/sasiddiq/missioncontrol/javamail.git', '/tmp/tmptdzt90xa/javamail', '--depth', '500', '--no-single-branch']
cwd: .
rc: 0
stdout: 
stderr: Cloning into '/tmp/tmptdzt90xa/javamail'...

Running: git checkout 6e47ec25c10a2f015af4973029edd65453fc56ab

cmd: ['git', 'checkout', '6e47ec25c10a2f015af4973029edd65453fc56ab']
cwd: /tmp/tmptdzt90xa/javamail
rc: 0
stdout: 
stderr: Note: checking out '6e47ec25c10a2f015af4973029edd65453fc56ab'.

You are in 'detached HEAD' state. You can look around, make experimental
changes and commit them, and you can discard any commits you make in this
state without impacting any branches by performing another checkout.

If you want to create a new branch to retain commits you create, you may
do so (now or later) by using -b with the checkout command again. Example:

  git checkout -b <new-branch-name>

HEAD is now at 6e47ec2 automatic import of javamail 1.6.3-3.fc29

Running: cp -r . /tmp/tmp_5_pa9xx

cmd: ['cp', '-r', '.', '/tmp/tmp_5_pa9xx']
cwd: /tmp/tmptdzt90xa/javamail
rc: 0
stdout: 
stderr: 

Generated rpkg config:
[rpkg]
preprocess_spec = True
# auto-packing is deprecated:
auto_pack = True

[git]
lookaside = https://copr-dist-git.fedorainfracloud.org/repo/pkgs/%(ns2)s/%(ns1)s/%(name)s/%(filename)s/%(hashtype)s/%(hash)s/%(filename)s
anongiturl = https://copr-dist-git.fedorainfracloud.org/git/%(module)s

Writing config into /tmp/tmptdzt90xa/.config/rpkg.conf
Running: rpkg -C /tmp/tmptdzt90xa/.config/rpkg.conf sources --outdir /tmp/tmp_5_pa9xx

cmd: ['rpkg', '-C', '/tmp/tmptdzt90xa/.config/rpkg.conf', 'sources', '--outdir', '/tmp/tmp_5_pa9xx']
cwd: /tmp/tmptdzt90xa/javamail
rc: 0
stdout: Downloading 1.6.3.tar.gz from lookaside cache at copr-dist-git.fedorainfracloud.org
stderr: 

/usr/bin/tail: /var/lib/copr-rpmbuild/main.log: file truncated
Running: unbuffer /usr/bin/mock --buildsrpm --spec /tmp/tmp_5_pa9xx/javamail.spec --sources /tmp/tmp_5_pa9xx --configdir /var/lib/copr-rpmbuild/results/configs --resultdir /var/lib/copr-rpmbuild/results --define %_disable_source_fetch 0 --uniqueext 1545256645.714611 -r child
WARNING: Could not find required logging config file: /var/lib/copr-rpmbuild/results/configs/logging.ini. Using default...
INFO: mock.py version 1.4.13 starting (python version = 3.6.5)...
Start: init plugins
INFO: tmpfs initialized
INFO: selinux disabled
INFO: chroot_scan: initialized
INFO: compress_logs: initialized
Finish: init plugins
Start: run
INFO: Start(/tmp/tmp_5_pa9xx/javamail.spec)  Config(838767-fedora-rawhide-x86_64)
Start: clean chroot
Finish: clean chroot
Start: chroot init
INFO: mounting tmpfs at /var/lib/mock/838767-fedora-rawhide-x86_64-1545256645.714611/root.
INFO: calling preinit hooks
INFO: enabled root cache
INFO: enabled HW Info plugin
Mock Version: 1.4.13
INFO: Mock Version: 1.4.13
Start: dnf install
'Copr repository'                               1.0 MB/s | 107 kB     00:00    
fedora                                           52 MB/s |  63 MB     00:01    
Last metadata expiration check: 0:00:00 ago on Wed 19 Dec 2018 09:57:28 PM UTC.
Dependencies resolved.
================================================================================
 Group                 Packages                                               
================================================================================
Marking packages as installed by the group:
 @Buildsystem building group
                       grep              diffutils              shadow-utils  
                       redhat-rpm-config util-linux             patch         
                       cpio              gawk                   xz            
                       rpm-build         bash                   fedora-release
                       sed               bzip2                  findutils     
                       coreutils         glibc-minimal-langpack which         
                       make              tar                    gzip          
                       info              unzip                                
================================================================================
 Package                    Arch   Version                         Repository
                                                                           Size
================================================================================
Installing group packages:
 bash                       x86_64 4.4.23-5.fc30                   fedora 1.5 M
 bzip2                      x86_64 1.0.6-28.fc29                   fedora  51 k
 coreutils                  x86_64 8.30-8.fc30                     fedora 999 k
 cpio                       x86_64 2.12-9.fc29                     fedora 252 k
 diffutils                  x86_64 3.6-5.fc29                      fedora 350 k
 fedora-release             noarch 30-0.18                         fedora 9.5 k
 findutils                  x86_64 1:4.6.0-21.fc30                 fedora 504 k
 gawk                       x86_64 4.2.1-3.fc29                    fedora 1.1 M
 glibc-minimal-langpack     x86_64 2.28.9000-27.fc30               fedora  45 k
 grep                       x86_64 3.1-8.fc29                      fedora 249 k
 gzip                       x86_64 1.9-7.fc29                      fedora 153 k
 info                       x86_64 6.5-11.fc30                     fedora 175 k
 make                       x86_64 1:4.2.1-10.fc29                 fedora 487 k
 patch                      x86_64 2.7.6-8.fc30                    fedora 123 k
 redhat-rpm-config          noarch 125-1.fc30                      fedora  59 k
 rpm-build                  x86_64 4.14.2.1-3.fc30                 fedora 113 k
 sed                        x86_64 4.5-2.fc29                      fedora 288 k
 shadow-utils               x86_64 2:4.6-5.fc30                    fedora 1.1 M
 tar                        x86_64 2:1.30-6.fc29                   fedora 805 k
 unzip                      x86_64 6.0-42.fc30                     fedora 175 k
 util-linux                 x86_64 2.33-0.1.fc30                   fedora 2.3 M
 which                      x86_64 2.21-11.fc29                    fedora  41 k
 xz                         x86_64 5.2.4-4.fc30                    fedora 143 k
Installing dependencies:
 audit-libs                 x86_64 3.0-0.4.20180831git0047a6c.fc30 fedora 107 k
 basesystem                 noarch 11-6.fc29                       fedora 6.9 k
 binutils                   x86_64 2.31.1-17.fc30                  fedora 5.6 M
 brotli                     x86_64 1.0.7-1.fc30                    fedora 314 k
 bzip2-libs                 x86_64 1.0.6-28.fc29                   fedora  39 k
 ca-certificates            noarch 2018.2.26-2.fc30                fedora 385 k
 chkconfig                  x86_64 1.11-2.fc30                     fedora 168 k
 coreutils-common           x86_64 8.30-8.fc30                     fedora 1.9 M
 cracklib                   x86_64 2.9.6-18.fc30                   fedora  77 k
 crypto-policies            noarch 20181122-1.git70769d9.fc30      fedora  46 k
 curl                       x86_64 7.63.0-2.fc30                   fedora 314 k
 cyrus-sasl-lib             x86_64 2.1.27-0.4rc7.fc30              fedora  92 k
 dwz                        x86_64 0.12-9.fc29                     fedora 105 k
 efi-srpm-macros            noarch 4-1.fc30                        fedora  22 k
 elfutils                   x86_64 0.175-2.fc30                    fedora 295 k
 elfutils-default-yama-scope
                            noarch 0.175-2.fc30                    fedora  16 k
 elfutils-libelf            x86_64 0.175-2.fc30                    fedora 178 k
 elfutils-libs              x86_64 0.175-2.fc30                    fedora 260 k
 expat                      x86_64 2.2.6-1.fc30                    fedora 100 k
 fedora-gpg-keys            noarch 30-0.2                          fedora  99 k
 fedora-release-common      noarch 30-0.18                         fedora  17 k
 fedora-repos               noarch 30-0.2                          fedora 8.9 k
 fedora-repos-rawhide       noarch 30-0.2                          fedora 8.1 k
 file                       x86_64 5.35-2.fc30                     fedora  49 k
 file-libs                  x86_64 5.35-2.fc30                     fedora 533 k
 filesystem                 x86_64 3.9-2.fc29                      fedora 1.1 M
 fpc-srpm-macros            noarch 1.1-5.fc29                      fedora 7.5 k
 gc                         x86_64 7.6.4-4.fc29                    fedora 101 k
 gdb-headless               x86_64 8.2.50.20181130-11.fc30         fedora 3.4 M
 gdbm-libs                  x86_64 1:1.18-1.fc30                   fedora  49 k
 ghc-srpm-macros            noarch 1.4.2-8.fc29                    fedora 7.4 k
 glib2                      x86_64 2.58.1-2.fc30                   fedora 2.5 M
 glibc                      x86_64 2.28.9000-27.fc30               fedora 3.8 M
 glibc-common               x86_64 2.28.9000-27.fc30               fedora 814 k
 gmp                        x86_64 1:6.1.2-8.fc29                  fedora 272 k
 gnat-srpm-macros           noarch 4-4.fc30                        fedora 7.9 k
 go-srpm-macros             noarch 2-18.fc29                       fedora  11 k
 guile                      x86_64 5:2.0.14-12.fc29                fedora 3.5 M
 keyutils-libs              x86_64 1.6-1.fc30                      fedora  29 k
 krb5-libs                  x86_64 1.17-1.beta2.1.fc30             fedora 707 k
 libacl                     x86_64 2.2.53-2.fc29                   fedora  25 k
 libarchive                 x86_64 3.3.3-2.fc30                    fedora 342 k
 libatomic_ops              x86_64 7.6.6-1.fc29                    fedora  34 k
 libattr                    x86_64 2.4.48-4.fc30                   fedora  17 k
 libbabeltrace              x86_64 1.5.6-1.fc29                    fedora 197 k
 libblkid                   x86_64 2.33-0.1.fc30                   fedora 145 k
 libcap                     x86_64 2.25-12.fc29                    fedora  49 k
 libcap-ng                  x86_64 0.7.9-5.fc30                    fedora  27 k
 libcom_err                 x86_64 1.44.4-1.fc30                   fedora  26 k
 libcurl                    x86_64 7.63.0-2.fc30                   fedora 252 k
 libdb                      x86_64 5.3.28-34.fc30                  fedora 734 k
 libdb-utils                x86_64 5.3.28-34.fc30                  fedora 128 k
 libfdisk                   x86_64 2.33-0.1.fc30                   fedora 194 k
 libffi                     x86_64 3.1-18.fc29                     fedora  32 k
 libgcc                     x86_64 8.2.1-6.fc30                    fedora  96 k
 libgcrypt                  x86_64 1.8.4-1.fc30                    fedora 435 k
 libgpg-error               x86_64 1.31-2.fc29                     fedora 235 k
 libidn2                    x86_64 2.0.5-2.fc29                    fedora  87 k
 libipt                     x86_64 2.0-1.fc30                      fedora  50 k
 libmetalink                x86_64 0.1.3-7.fc29                    fedora  29 k
 libmount                   x86_64 2.33-0.1.fc30                   fedora 166 k
 libnghttp2                 x86_64 1.35.1-1.fc30                   fedora  70 k
 libnsl2                    x86_64 1.2.0-3.20180605git4a062cf.fc30 fedora  54 k
 libpkgconf                 x86_64 1.5.4-1.fc30                    fedora  35 k
 libpsl                     x86_64 0.20.2-5.fc29                   fedora  58 k
 libpwquality               x86_64 1.4.0-11.fc30                   fedora  96 k
 libselinux                 x86_64 2.8-5.fc30                      fedora  79 k
 libsemanage                x86_64 2.8-7.fc30                      fedora 109 k
 libsepol                   x86_64 2.8-3.fc30                      fedora 280 k
 libsigsegv                 x86_64 2.11-6.fc29                     fedora  26 k
 libsmartcols               x86_64 2.33-0.1.fc30                   fedora 107 k
 libssh                     x86_64 0.8.5-1.fc30                    fedora 210 k
 libstdc++                  x86_64 8.2.1-6.fc30                    fedora 456 k
 libtasn1                   x86_64 4.13-6.fc30                     fedora  67 k
 libtirpc                   x86_64 1.1.4-2.rc2.fc30                fedora  96 k
 libtool-ltdl               x86_64 2.4.6-27.fc30                   fedora  34 k
 libunistring               x86_64 0.9.10-4.fc29                   fedora 416 k
 libutempter                x86_64 1.1.6-15.fc29                   fedora  25 k
 libuuid                    x86_64 2.33-0.1.fc30                   fedora  26 k
 libverto                   x86_64 0.3.0-6.fc29                    fedora  21 k
 libxcrypt                  x86_64 4.4.1-1.fc30                    fedora 114 k
 libxml2                    x86_64 2.9.8-4.fc29                    fedora 648 k
 libzstd                    x86_64 1.3.6-1.fc30                    fedora 242 k
 lua-libs                   x86_64 5.3.5-2.fc29                    fedora 111 k
 lz4-libs                   x86_64 1.8.2-2.fc29                    fedora  60 k
 mpfr                       x86_64 3.1.6-3.fc30                    fedora 212 k
 ncurses                    x86_64 6.1-8.20180923.fc30             fedora 359 k
 ncurses-base               noarch 6.1-8.20180923.fc30             fedora  58 k
 ncurses-libs               x86_64 6.1-8.20180923.fc30             fedora 287 k
 nim-srpm-macros            noarch 1-3.fc29                        fedora 8.0 k
 ocaml-srpm-macros          noarch 5-4.fc29                        fedora 7.8 k
 openblas-srpm-macros       noarch 2-4.fc29                        fedora 7.2 k
 openldap                   x86_64 2.4.46-10.fc30                  fedora 281 k
 openssl-libs               x86_64 1:1.1.1-7.fc30                  fedora 1.3 M
 p11-kit                    x86_64 0.23.14-1.fc30                  fedora 240 k
 p11-kit-trust              x86_64 0.23.14-1.fc30                  fedora 124 k
 pam                        x86_64 1.3.1-14.fc30                   fedora 622 k
 pcre                       x86_64 8.42-5.fc30                     fedora 186 k
 pcre2                      x86_64 10.32-4.fc30                    fedora 235 k
 perl-srpm-macros           noarch 1-28.fc29                       fedora 8.1 k
 pkgconf                    x86_64 1.5.4-1.fc30                    fedora  38 k
 pkgconf-m4                 noarch 1.5.4-1.fc30                    fedora  16 k
 pkgconf-pkg-config         x86_64 1.5.4-1.fc30                    fedora  14 k
 popt                       x86_64 1.16-16.fc30                    fedora  55 k
 publicsuffix-list-dafsa    noarch 20180723-1.fc29                 fedora  54 k
 python-pip-wheel           noarch 18.1-1.fc30                     fedora 1.2 M
 python-setuptools-wheel    noarch 40.4.3-1.fc30                   fedora 274 k
 python-srpm-macros         noarch 3-39.fc30                       fedora  12 k
 python3-libs               x86_64 3.7.1-4.fc30                    fedora 7.8 M
 qt5-srpm-macros            noarch 5.11.3-1.fc30                   fedora 9.1 k
 readline                   x86_64 7.0-12.fc29                     fedora 189 k
 rpm                        x86_64 4.14.2.1-3.fc30                 fedora 486 k
 rpm-build-libs             x86_64 4.14.2.1-3.fc30                 fedora  93 k
 rpm-libs                   x86_64 4.14.2.1-3.fc30                 fedora 271 k
 rust-srpm-macros           noarch 6-1.fc30                        fedora 8.4 k
 setup                      noarch 2.12.6-1.fc30                   fedora 148 k
 sqlite-libs                x86_64 3.26.0-1.fc30                   fedora 540 k
 systemd-libs               x86_64 239-9.git9f3aed1.fc30           fedora 460 k
 tzdata                     noarch 2018g-1.fc30                    fedora 425 k
 xz-libs                    x86_64 5.2.4-4.fc30                    fedora  84 k
 zip                        x86_64 3.0-23.fc29                     fedora 264 k
 zlib                       x86_64 1.2.11-14.fc30                  fedora  89 k
 zstd                       x86_64 1.3.6-1.fc30                    fedora 343 k

Transaction Summary
================================================================================
Install  146 Packages

Total download size: 61 M
Installed size: 237 M
Downloading Packages:
(1/146): diffutils-3.6-5.fc29.x86_64.rpm        5.9 MB/s | 350 kB     00:00    
(2/146): gzip-1.9-7.fc29.x86_64.rpm             2.5 MB/s | 153 kB     00:00    
(3/146): shadow-utils-4.6-5.fc30.x86_64.rpm      15 MB/s | 1.1 MB     00:00    
(4/146): make-4.2.1-10.fc29.x86_64.rpm           21 MB/s | 487 kB     00:00    
(5/146): redhat-rpm-config-125-1.fc30.noarch.rp 8.7 MB/s |  59 kB     00:00    
(6/146): glibc-minimal-langpack-2.28.9000-27.fc  12 MB/s |  45 kB     00:00    
(7/146): fedora-release-30-0.18.noarch.rpm      4.0 MB/s | 9.5 kB     00:00    
(8/146): findutils-4.6.0-21.fc30.x86_64.rpm      30 MB/s | 504 kB     00:00    
(9/146): sed-4.5-2.fc29.x86_64.rpm               19 MB/s | 288 kB     00:00    
(10/146): rpm-build-4.14.2.1-3.fc30.x86_64.rpm   19 MB/s | 113 kB     00:00    
(11/146): which-2.21-11.fc29.x86_64.rpm         9.7 MB/s |  41 kB     00:00    
(12/146): grep-3.1-8.fc29.x86_64.rpm             24 MB/s | 249 kB     00:00    
(13/146): bash-4.4.23-5.fc30.x86_64.rpm          23 MB/s | 1.5 MB     00:00    
(14/146): patch-2.7.6-8.fc30.x86_64.rpm         9.1 MB/s | 123 kB     00:00    
(15/146): info-6.5-11.fc30.x86_64.rpm            21 MB/s | 175 kB     00:00    
(16/146): unzip-6.0-42.fc30.x86_64.rpm           19 MB/s | 175 kB     00:00    
(17/146): cpio-2.12-9.fc29.x86_64.rpm            23 MB/s | 252 kB     00:00    
(18/146): tar-1.30-6.fc29.x86_64.rpm             21 MB/s | 805 kB     00:00    
(19/146): xz-5.2.4-4.fc30.x86_64.rpm             16 MB/s | 143 kB     00:00    
(20/146): bzip2-1.0.6-28.fc29.x86_64.rpm         10 MB/s |  51 kB     00:00    
(21/146): coreutils-8.30-8.fc30.x86_64.rpm       30 MB/s | 999 kB     00:00    
(22/146): audit-libs-3.0-0.4.20180831git0047a6c  18 MB/s | 107 kB     00:00    
(23/146): gawk-4.2.1-3.fc29.x86_64.rpm           29 MB/s | 1.1 MB     00:00    
(24/146): libacl-2.2.53-2.fc29.x86_64.rpm       5.6 MB/s |  25 kB     00:00    
(25/146): libattr-2.4.48-4.fc30.x86_64.rpm      4.7 MB/s |  17 kB     00:00    
(26/146): libselinux-2.8-5.fc30.x86_64.rpm       17 MB/s |  79 kB     00:00    
(27/146): libsemanage-2.8-7.fc30.x86_64.rpm      17 MB/s | 109 kB     00:00    
(28/146): util-linux-2.33-0.1.fc30.x86_64.rpm    31 MB/s | 2.3 MB     00:00    
(29/146): libxcrypt-4.4.1-1.fc30.x86_64.rpm     6.6 MB/s | 114 kB     00:00    
(30/146): setup-2.12.6-1.fc30.noarch.rpm         22 MB/s | 148 kB     00:00    
(31/146): filesystem-3.9-2.fc29.x86_64.rpm       33 MB/s | 1.1 MB     00:00    
(32/146): glibc-2.28.9000-27.fc30.x86_64.rpm     30 MB/s | 3.8 MB     00:00    
(33/146): ncurses-libs-6.1-8.20180923.fc30.x86_ 8.3 MB/s | 287 kB     00:00    
(34/146): dwz-0.12-9.fc29.x86_64.rpm             17 MB/s | 105 kB     00:00    
(35/146): efi-srpm-macros-4-1.fc30.noarch.rpm   3.5 MB/s |  22 kB     00:00    
(36/146): fpc-srpm-macros-1.1-5.fc29.noarch.rpm 2.1 MB/s | 7.5 kB     00:00    
(37/146): file-5.35-2.fc30.x86_64.rpm           9.3 MB/s |  49 kB     00:00    
(38/146): ghc-srpm-macros-1.4.2-8.fc29.noarch.r 2.0 MB/s | 7.4 kB     00:00    
(39/146): gnat-srpm-macros-4-4.fc30.noarch.rpm  2.3 MB/s | 7.9 kB     00:00    
(40/146): go-srpm-macros-2-18.fc29.noarch.rpm   3.3 MB/s |  11 kB     00:00    
(41/146): nim-srpm-macros-1-3.fc29.noarch.rpm   2.4 MB/s | 8.0 kB     00:00    
(42/146): ocaml-srpm-macros-5-4.fc29.noarch.rpm 2.5 MB/s | 7.8 kB     00:00    
(43/146): openblas-srpm-macros-2-4.fc29.noarch. 2.2 MB/s | 7.2 kB     00:00    
(44/146): perl-srpm-macros-1-28.fc29.noarch.rpm 2.7 MB/s | 8.1 kB     00:00    
(45/146): python-srpm-macros-3-39.fc30.noarch.r 3.7 MB/s |  12 kB     00:00    
(46/146): qt5-srpm-macros-5.11.3-1.fc30.noarch. 2.3 MB/s | 9.1 kB     00:00    
(47/146): rust-srpm-macros-6-1.fc30.noarch.rpm  2.2 MB/s | 8.4 kB     00:00    
(48/146): rpm-4.14.2.1-3.fc30.x86_64.rpm         33 MB/s | 486 kB     00:00    
(49/146): zip-3.0-23.fc29.x86_64.rpm             22 MB/s | 264 kB     00:00    
(50/146): fedora-release-common-30-0.18.noarch. 3.5 MB/s |  17 kB     00:00    
(51/146): guile-2.0.14-12.fc29.x86_64.rpm        24 MB/s | 3.5 MB     00:00    
(52/146): glibc-common-2.28.9000-27.fc30.x86_64  20 MB/s | 814 kB     00:00    
(53/146): elfutils-0.175-2.fc30.x86_64.rpm       19 MB/s | 295 kB     00:00    
(54/146): elfutils-libelf-0.175-2.fc30.x86_64.r  22 MB/s | 178 kB     00:00    
(55/146): elfutils-libs-0.175-2.fc30.x86_64.rpm  24 MB/s | 260 kB     00:00    
(56/146): popt-1.16-16.fc30.x86_64.rpm          9.2 MB/s |  55 kB     00:00    
(57/146): rpm-build-libs-4.14.2.1-3.fc30.x86_64  15 MB/s |  93 kB     00:00    
(58/146): rpm-libs-4.14.2.1-3.fc30.x86_64.rpm    21 MB/s | 271 kB     00:00    
(59/146): zstd-1.3.6-1.fc30.x86_64.rpm           22 MB/s | 343 kB     00:00    
(60/146): pcre-8.42-5.fc30.x86_64.rpm            18 MB/s | 186 kB     00:00    
(61/146): zlib-1.2.11-14.fc30.x86_64.rpm         13 MB/s |  89 kB     00:00    
(62/146): bzip2-libs-1.0.6-28.fc29.x86_64.rpm    11 MB/s |  39 kB     00:00    
(63/146): gdb-headless-8.2.50.20181130-11.fc30.  36 MB/s | 3.4 MB     00:00    
(64/146): gmp-6.1.2-8.fc29.x86_64.rpm            26 MB/s | 272 kB     00:00    
(65/146): libcap-2.25-12.fc29.x86_64.rpm        7.0 MB/s |  49 kB     00:00    
(66/146): coreutils-common-8.30-8.fc30.x86_64.r  30 MB/s | 1.9 MB     00:00    
(67/146): ncurses-6.1-8.20180923.fc30.x86_64.rp  16 MB/s | 359 kB     00:00    
(68/146): binutils-2.31.1-17.fc30.x86_64.rpm     27 MB/s | 5.6 MB     00:00    
(69/146): xz-libs-5.2.4-4.fc30.x86_64.rpm       2.5 MB/s |  84 kB     00:00    
(70/146): libsigsegv-2.11-6.fc29.x86_64.rpm     5.1 MB/s |  26 kB     00:00    
(71/146): mpfr-3.1.6-3.fc30.x86_64.rpm           21 MB/s | 212 kB     00:00    
(72/146): readline-7.0-12.fc29.x86_64.rpm        20 MB/s | 189 kB     00:00    
(73/146): libblkid-2.33-0.1.fc30.x86_64.rpm      23 MB/s | 145 kB     00:00    
(74/146): libcap-ng-0.7.9-5.fc30.x86_64.rpm     7.1 MB/s |  27 kB     00:00    
(75/146): openssl-libs-1.1.1-7.fc30.x86_64.rpm   21 MB/s | 1.3 MB     00:00    
(76/146): libmount-2.33-0.1.fc30.x86_64.rpm      12 MB/s | 166 kB     00:00    
(77/146): libfdisk-2.33-0.1.fc30.x86_64.rpm      12 MB/s | 194 kB     00:00    
(78/146): libutempter-1.1.6-15.fc29.x86_64.rpm  9.0 MB/s |  25 kB     00:00    
(79/146): libsmartcols-2.33-0.1.fc30.x86_64.rpm  15 MB/s | 107 kB     00:00    
(80/146): libuuid-2.33-0.1.fc30.x86_64.rpm      6.9 MB/s |  26 kB     00:00    
(81/146): basesystem-11-6.fc29.noarch.rpm       1.4 MB/s | 6.9 kB     00:00    
(82/146): pam-1.3.1-14.fc30.x86_64.rpm           40 MB/s | 622 kB     00:00    
(83/146): libgcc-8.2.1-6.fc30.x86_64.rpm         12 MB/s |  96 kB     00:00    
(84/146): systemd-libs-239-9.git9f3aed1.fc30.x8  25 MB/s | 460 kB     00:00    
(85/146): pcre2-10.32-4.fc30.x86_64.rpm          28 MB/s | 235 kB     00:00    
(86/146): gc-7.6.4-4.fc29.x86_64.rpm             16 MB/s | 101 kB     00:00    
(87/146): libsepol-2.8-3.fc30.x86_64.rpm         22 MB/s | 280 kB     00:00    
(88/146): libffi-3.1-18.fc29.x86_64.rpm         7.4 MB/s |  32 kB     00:00    
(89/146): libtool-ltdl-2.4.6-27.fc30.x86_64.rpm 8.3 MB/s |  34 kB     00:00    
(90/146): ncurses-base-6.1-8.20180923.fc30.noar  11 MB/s |  58 kB     00:00    
(91/146): libunistring-0.9.10-4.fc29.x86_64.rpm  37 MB/s | 416 kB     00:00    
(92/146): libdb-utils-5.3.28-34.fc30.x86_64.rpm  21 MB/s | 128 kB     00:00    
(93/146): libarchive-3.3.3-2.fc30.x86_64.rpm     26 MB/s | 342 kB     00:00    
(94/146): file-libs-5.35-2.fc30.x86_64.rpm       25 MB/s | 533 kB     00:00    
(95/146): fedora-repos-30-0.2.noarch.rpm        2.1 MB/s | 8.9 kB     00:00    
(96/146): chkconfig-1.11-2.fc30.x86_64.rpm       30 MB/s | 168 kB     00:00    
(97/146): tzdata-2018g-1.fc30.noarch.rpm         26 MB/s | 425 kB     00:00    
(98/146): elfutils-default-yama-scope-0.175-2.f 3.4 MB/s |  16 kB     00:00    
(99/146): expat-2.2.6-1.fc30.x86_64.rpm          26 MB/s | 100 kB     00:00    
(100/146): libstdc++-8.2.1-6.fc30.x86_64.rpm     27 MB/s | 456 kB     00:00    
(101/146): libipt-2.0-1.fc30.x86_64.rpm          10 MB/s |  50 kB     00:00    
(102/146): libbabeltrace-1.5.6-1.fc29.x86_64.rp  17 MB/s | 197 kB     00:00    
(103/146): libzstd-1.3.6-1.fc30.x86_64.rpm       17 MB/s | 242 kB     00:00    
(104/146): libdb-5.3.28-34.fc30.x86_64.rpm       32 MB/s | 734 kB     00:00    
(105/146): lua-libs-5.3.5-2.fc29.x86_64.rpm      14 MB/s | 111 kB     00:00    
(106/146): crypto-policies-20181122-1.git70769d 7.0 MB/s |  46 kB     00:00    
(107/146): ca-certificates-2018.2.26-2.fc30.noa  28 MB/s | 385 kB     00:00    
(108/146): cracklib-2.9.6-18.fc30.x86_64.rpm     14 MB/s |  77 kB     00:00    
(109/146): libnsl2-1.2.0-3.20180605git4a062cf.f  12 MB/s |  54 kB     00:00    
(110/146): libtirpc-1.1.4-2.rc2.fc30.x86_64.rpm  17 MB/s |  96 kB     00:00    
(111/146): lz4-libs-1.8.2-2.fc29.x86_64.rpm     6.6 MB/s |  60 kB     00:00    
(112/146): libgcrypt-1.8.4-1.fc30.x86_64.rpm     28 MB/s | 435 kB     00:00    
(113/146): libatomic_ops-7.6.6-1.fc29.x86_64.rp 8.4 MB/s |  34 kB     00:00    
(114/146): fedora-gpg-keys-30-0.2.noarch.rpm     12 MB/s |  99 kB     00:00    
(115/146): fedora-repos-rawhide-30-0.2.noarch.r 1.8 MB/s | 8.1 kB     00:00    
(116/146): libxml2-2.9.8-4.fc29.x86_64.rpm       32 MB/s | 648 kB     00:00    
(117/146): gdbm-libs-1.18-1.fc30.x86_64.rpm     6.9 MB/s |  49 kB     00:00    
(118/146): python-pip-wheel-18.1-1.fc30.noarch.  33 MB/s | 1.2 MB     00:00    
(119/146): python-setuptools-wheel-40.4.3-1.fc3  21 MB/s | 274 kB     00:00    
(120/146): sqlite-libs-3.26.0-1.fc30.x86_64.rpm  34 MB/s | 540 kB     00:00    
(121/146): glib2-2.58.1-2.fc30.x86_64.rpm        26 MB/s | 2.5 MB     00:00    
(122/146): libcom_err-1.44.4-1.fc30.x86_64.rpm  9.3 MB/s |  26 kB     00:00    
(123/146): python3-libs-3.7.1-4.fc30.x86_64.rpm  37 MB/s | 7.8 MB     00:00    
(124/146): krb5-libs-1.17-1.beta2.1.fc30.x86_64  11 MB/s | 707 kB     00:00    
(125/146): libgpg-error-1.31-2.fc29.x86_64.rpm  5.1 MB/s | 235 kB     00:00    
(126/146): keyutils-libs-1.6-1.fc30.x86_64.rpm  3.1 MB/s |  29 kB     00:00    
(127/146): pkgconf-pkg-config-1.5.4-1.fc30.x86_ 4.3 MB/s |  14 kB     00:00    
(128/146): libverto-0.3.0-6.fc29.x86_64.rpm     4.9 MB/s |  21 kB     00:00    
(129/146): pkgconf-1.5.4-1.fc30.x86_64.rpm      9.2 MB/s |  38 kB     00:00    
(130/146): pkgconf-m4-1.5.4-1.fc30.noarch.rpm   3.6 MB/s |  16 kB     00:00    
(131/146): libpkgconf-1.5.4-1.fc30.x86_64.rpm   7.6 MB/s |  35 kB     00:00    
(132/146): libpwquality-1.4.0-11.fc30.x86_64.rp  23 MB/s |  96 kB     00:00    
(133/146): p11-kit-trust-0.23.14-1.fc30.x86_64.  22 MB/s | 124 kB     00:00    
(134/146): libtasn1-4.13-6.fc30.x86_64.rpm       14 MB/s |  67 kB     00:00    
(135/146): p11-kit-0.23.14-1.fc30.x86_64.rpm     24 MB/s | 240 kB     00:00    
(136/146): libmetalink-0.1.3-7.fc29.x86_64.rpm  5.7 MB/s |  29 kB     00:00    
(137/146): curl-7.63.0-2.fc30.x86_64.rpm         30 MB/s | 314 kB     00:00    
(138/146): libcurl-7.63.0-2.fc30.x86_64.rpm      24 MB/s | 252 kB     00:00    
(139/146): libidn2-2.0.5-2.fc29.x86_64.rpm       15 MB/s |  87 kB     00:00    
(140/146): brotli-1.0.7-1.fc30.x86_64.rpm        25 MB/s | 314 kB     00:00    
(141/146): libnghttp2-1.35.1-1.fc30.x86_64.rpm   11 MB/s |  70 kB     00:00    
(142/146): libpsl-0.20.2-5.fc29.x86_64.rpm       11 MB/s |  58 kB     00:00    
(143/146): libssh-0.8.5-1.fc30.x86_64.rpm        29 MB/s | 210 kB     00:00    
(144/146): openldap-2.4.46-10.fc30.x86_64.rpm    27 MB/s | 281 kB     00:00    
(145/146): publicsuffix-list-dafsa-20180723-1.f 5.8 MB/s |  54 kB     00:00    
(146/146): cyrus-sasl-lib-2.1.27-0.4rc7.fc30.x8  17 MB/s |  92 kB     00:00    
--------------------------------------------------------------------------------
Total                                            61 MB/s |  61 MB     00:01     
warning: /var/lib/mock/838767-fedora-rawhide-x86_64-1545256645.714611/root/var/cache/dnf/fedora-2d95c80a1fa0a67d/packages/shadow-utils-4.6-5.fc30.x86_64.rpm: Header V3 RSA/SHA256 Signature, key ID cfc659b9: NOKEY
Importing GPG key 0xCFC659B9:
 Userid     : "Fedora (30) <fedora-30-primary@fedoraproject.org>"
 Fingerprint: F1D8 EC98 F241 AAF2 0DF6 9420 EF3C 111F CFC6 59B9
 From       : /usr/share/distribution-gpg-keys/fedora/RPM-GPG-KEY-fedora-30-primary
Key imported successfully
Importing GPG key 0x429476B4:
 Userid     : "Fedora 29 (29) <fedora-29@fedoraproject.org>"
 Fingerprint: 5A03 B4DD 8254 ECA0 2FDA 1637 A20A A56B 4294 76B4
 From       : /usr/share/distribution-gpg-keys/fedora/RPM-GPG-KEY-fedora-29-primary
Key imported successfully
Running transaction check
Transaction check succeeded.
Running transaction test
Transaction test succeeded.
Running transaction
  Running scriptlet: filesystem-3.9-2.fc29.x86_64                           1/1 
  Preparing        :                                                        1/1 
  Installing       : libgcc-8.2.1-6.fc30.x86_64                           1/146 
  Running scriptlet: libgcc-8.2.1-6.fc30.x86_64                           1/146 
  Installing       : publicsuffix-list-dafsa-20180723-1.fc29.noarch       2/146 
  Installing       : pkgconf-m4-1.5.4-1.fc30.noarch                       3/146 
  Installing       : python-setuptools-wheel-40.4.3-1.fc30.noarch         4/146 
  Installing       : python-pip-wheel-18.1-1.fc30.noarch                  5/146 
  Installing       : fedora-gpg-keys-30-0.2.noarch                        6/146 
  Installing       : fedora-release-common-30-0.18.noarch                 7/146 
  Installing       : fedora-release-30-0.18.noarch                        8/146 
  Installing       : fedora-repos-rawhide-30-0.2.noarch                   9/146 
  Installing       : fedora-repos-30-0.2.noarch                          10/146 
  Installing       : setup-2.12.6-1.fc30.noarch                          11/146 
  Running scriptlet: setup-2.12.6-1.fc30.noarch                          11/146 
warning: /etc/hosts created as /etc/hosts.rpmnew
  Installing       : filesystem-3.9-2.fc29.x86_64                        12/146 
  Installing       : basesystem-11-6.fc29.noarch                         13/146 
  Installing       : tzdata-2018g-1.fc30.noarch                          14/146 
  Installing       : ncurses-base-6.1-8.20180923.fc30.noarch             15/146 
  Installing       : pcre2-10.32-4.fc30.x86_64                           16/146 
  Installing       : libselinux-2.8-5.fc30.x86_64                        17/146 
  Installing       : glibc-minimal-langpack-2.28.9000-27.fc30.x86_64     18/146 
  Installing       : ncurses-libs-6.1-8.20180923.fc30.x86_64             19/146 
  Installing       : glibc-common-2.28.9000-27.fc30.x86_64               20/146 
  Running scriptlet: glibc-2.28.9000-27.fc30.x86_64                      21/146 
  Installing       : glibc-2.28.9000-27.fc30.x86_64                      21/146 
  Running scriptlet: glibc-2.28.9000-27.fc30.x86_64                      21/146 
  Installing       : bash-4.4.23-5.fc30.x86_64                           22/146 
  Running scriptlet: bash-4.4.23-5.fc30.x86_64                           22/146 
  Installing       : libsepol-2.8-3.fc30.x86_64                          23/146 
  Running scriptlet: libsepol-2.8-3.fc30.x86_64                          23/146 
  Installing       : zlib-1.2.11-14.fc30.x86_64                          24/146 
  Installing       : bzip2-libs-1.0.6-28.fc29.x86_64                     25/146 
  Installing       : xz-libs-5.2.4-4.fc30.x86_64                         26/146 
  Installing       : elfutils-libelf-0.175-2.fc30.x86_64                 27/146 
  Installing       : libxcrypt-4.4.1-1.fc30.x86_64                       28/146 
  Installing       : popt-1.16-16.fc30.x86_64                            29/146 
  Installing       : libuuid-2.33-0.1.fc30.x86_64                        30/146 
  Installing       : libstdc++-8.2.1-6.fc30.x86_64                       31/146 
  Running scriptlet: libstdc++-8.2.1-6.fc30.x86_64                       31/146 
  Installing       : libdb-5.3.28-34.fc30.x86_64                         32/146 
  Running scriptlet: libdb-5.3.28-34.fc30.x86_64                         32/146 
  Installing       : libattr-2.4.48-4.fc30.x86_64                        33/146 
  Installing       : libacl-2.2.53-2.fc29.x86_64                         34/146 
  Installing       : sed-4.5-2.fc29.x86_64                               35/146 
  Installing       : gmp-1:6.1.2-8.fc29.x86_64                           36/146 
  Running scriptlet: gmp-1:6.1.2-8.fc29.x86_64                           36/146 
  Installing       : libcap-2.25-12.fc29.x86_64                          37/146 
  Installing       : readline-7.0-12.fc29.x86_64                         38/146 
  Installing       : libffi-3.1-18.fc29.x86_64                           39/146 
  Installing       : libcom_err-1.44.4-1.fc30.x86_64                     40/146 
  Running scriptlet: libcom_err-1.44.4-1.fc30.x86_64                     40/146 
  Installing       : info-6.5-11.fc30.x86_64                             41/146 
  Installing       : libunistring-0.9.10-4.fc29.x86_64                   42/146 
  Installing       : expat-2.2.6-1.fc30.x86_64                           43/146 
  Installing       : libzstd-1.3.6-1.fc30.x86_64                         44/146 
  Installing       : libidn2-2.0.5-2.fc29.x86_64                         45/146 
  Installing       : findutils-1:4.6.0-21.fc30.x86_64                    46/146 
  Running scriptlet: findutils-1:4.6.0-21.fc30.x86_64                    46/146 
  Installing       : p11-kit-0.23.14-1.fc30.x86_64                       47/146 
  Running scriptlet: p11-kit-0.23.14-1.fc30.x86_64                       47/146 
  Installing       : mpfr-3.1.6-3.fc30.x86_64                            48/146 
  Installing       : chkconfig-1.11-2.fc30.x86_64                        49/146 
  Installing       : unzip-6.0-42.fc30.x86_64                            50/146 
  Installing       : file-libs-5.35-2.fc30.x86_64                        51/146 
  Installing       : file-5.35-2.fc30.x86_64                             52/146 
  Installing       : elfutils-default-yama-scope-0.175-2.fc30.noarch     53/146 
  Running scriptlet: elfutils-default-yama-scope-0.175-2.fc30.noarch     53/146 
  Installing       : elfutils-libs-0.175-2.fc30.x86_64                   54/146 
  Installing       : pcre-8.42-5.fc30.x86_64                             55/146 
  Installing       : grep-3.1-8.fc29.x86_64                              56/146 
  Installing       : libcap-ng-0.7.9-5.fc30.x86_64                       57/146 
  Installing       : audit-libs-3.0-0.4.20180831git0047a6c.fc30.x86_6    58/146 
  Running scriptlet: audit-libs-3.0-0.4.20180831git0047a6c.fc30.x86_6    58/146 
  Installing       : lua-libs-5.3.5-2.fc29.x86_64                        59/146 
  Installing       : lz4-libs-1.8.2-2.fc29.x86_64                        60/146 
  Installing       : libsemanage-2.8-7.fc30.x86_64                       61/146 
  Installing       : xz-5.2.4-4.fc30.x86_64                              62/146 
  Installing       : elfutils-0.175-2.fc30.x86_64                        63/146 
  Installing       : zip-3.0-23.fc29.x86_64                              64/146 
  Installing       : libpsl-0.20.2-5.fc29.x86_64                         65/146 
  Installing       : libmetalink-0.1.3-7.fc29.x86_64                     66/146 
  Installing       : tar-2:1.30-6.fc29.x86_64                            67/146 
  Installing       : patch-2.7.6-8.fc30.x86_64                           68/146 
  Installing       : libdb-utils-5.3.28-34.fc30.x86_64                   69/146 
  Installing       : zstd-1.3.6-1.fc30.x86_64                            70/146 
  Installing       : dwz-0.12-9.fc29.x86_64                              71/146 
  Installing       : libxml2-2.9.8-4.fc29.x86_64                         72/146 
  Installing       : bzip2-1.0.6-28.fc29.x86_64                          73/146 
  Installing       : sqlite-libs-3.26.0-1.fc30.x86_64                    74/146 
  Installing       : diffutils-3.6-5.fc29.x86_64                         75/146 
  Installing       : cpio-2.12-9.fc29.x86_64                             76/146 
  Installing       : ncurses-6.1-8.20180923.fc30.x86_64                  77/146 
  Installing       : libsigsegv-2.11-6.fc29.x86_64                       78/146 
  Installing       : gawk-4.2.1-3.fc29.x86_64                            79/146 
  Installing       : libsmartcols-2.33-0.1.fc30.x86_64                   80/146 
  Installing       : libtool-ltdl-2.4.6-27.fc30.x86_64                   81/146 
  Installing       : libipt-2.0-1.fc30.x86_64                            82/146 
  Installing       : libatomic_ops-7.6.6-1.fc29.x86_64                   83/146 
  Installing       : gc-7.6.4-4.fc29.x86_64                              84/146 
  Installing       : gdbm-libs-1:1.18-1.fc30.x86_64                      85/146 
  Installing       : libgpg-error-1.31-2.fc29.x86_64                     86/146 
  Installing       : libgcrypt-1.8.4-1.fc30.x86_64                       87/146 
  Running scriptlet: libgcrypt-1.8.4-1.fc30.x86_64                       87/146 
  Installing       : keyutils-libs-1.6-1.fc30.x86_64                     88/146 
  Installing       : libverto-0.3.0-6.fc29.x86_64                        89/146 
  Installing       : libpkgconf-1.5.4-1.fc30.x86_64                      90/146 
  Installing       : pkgconf-1.5.4-1.fc30.x86_64                         91/146 
  Installing       : pkgconf-pkg-config-1.5.4-1.fc30.x86_64              92/146 
  Installing       : libtasn1-4.13-6.fc30.x86_64                         93/146 
  Installing       : p11-kit-trust-0.23.14-1.fc30.x86_64                 94/146 
  Running scriptlet: p11-kit-trust-0.23.14-1.fc30.x86_64                 94/146 
  Installing       : brotli-1.0.7-1.fc30.x86_64                          95/146 
  Installing       : libnghttp2-1.35.1-1.fc30.x86_64                     96/146 
  Installing       : coreutils-common-8.30-8.fc30.x86_64                 97/146 
  Installing       : openssl-libs-1:1.1.1-7.fc30.x86_64                  98/146 
  Running scriptlet: openssl-libs-1:1.1.1-7.fc30.x86_64                  98/146 
  Installing       : coreutils-8.30-8.fc30.x86_64                        99/146 
  Installing       : crypto-policies-20181122-1.git70769d9.fc30.noarc   100/146 
  Running scriptlet: crypto-policies-20181122-1.git70769d9.fc30.noarc   100/146 
  Running scriptlet: ca-certificates-2018.2.26-2.fc30.noarch            101/146 
  Installing       : ca-certificates-2018.2.26-2.fc30.noarch            101/146 
  Running scriptlet: ca-certificates-2018.2.26-2.fc30.noarch            101/146 
  Installing       : krb5-libs-1.17-1.beta2.1.fc30.x86_64               102/146 
  Installing       : libtirpc-1.1.4-2.rc2.fc30.x86_64                   103/146 
  Installing       : libblkid-2.33-0.1.fc30.x86_64                      104/146 
  Running scriptlet: libblkid-2.33-0.1.fc30.x86_64                      104/146 
  Installing       : libmount-2.33-0.1.fc30.x86_64                      105/146 
  Installing       : libnsl2-1.2.0-3.20180605git4a062cf.fc30.x86_64     106/146 
  Installing       : gzip-1.9-7.fc29.x86_64                             107/146 
  Installing       : cracklib-2.9.6-18.fc30.x86_64                      108/146 
  Installing       : pam-1.3.1-14.fc30.x86_64                           109/146 
  Installing       : libpwquality-1.4.0-11.fc30.x86_64                  110/146 
  Installing       : guile-5:2.0.14-12.fc29.x86_64                      111/146 
  Installing       : python3-libs-3.7.1-4.fc30.x86_64                   112/146 
  Installing       : systemd-libs-239-9.git9f3aed1.fc30.x86_64          113/146 
  Running scriptlet: systemd-libs-239-9.git9f3aed1.fc30.x86_64          113/146 
  Installing       : glib2-2.58.1-2.fc30.x86_64                         114/146 
  Installing       : libbabeltrace-1.5.6-1.fc29.x86_64                  115/146 
  Running scriptlet: libbabeltrace-1.5.6-1.fc29.x86_64                  115/146 
  Installing       : libfdisk-2.33-0.1.fc30.x86_64                      116/146 
  Installing       : libssh-0.8.5-1.fc30.x86_64                         117/146 
  Installing       : cyrus-sasl-lib-2.1.27-0.4rc7.fc30.x86_64           118/146 
  Running scriptlet: cyrus-sasl-lib-2.1.27-0.4rc7.fc30.x86_64           118/146 
  Installing       : openldap-2.4.46-10.fc30.x86_64                     119/146 
  Installing       : libcurl-7.63.0-2.fc30.x86_64                       120/146 
  Installing       : curl-7.63.0-2.fc30.x86_64                          121/146 
  Installing       : shadow-utils-2:4.6-5.fc30.x86_64                   122/146 
  Running scriptlet: libutempter-1.1.6-15.fc29.x86_64                   123/146 
  Installing       : libutempter-1.1.6-15.fc29.x86_64                   123/146 
  Installing       : binutils-2.31.1-17.fc30.x86_64                     124/146 
  Running scriptlet: binutils-2.31.1-17.fc30.x86_64                     124/146 
  Installing       : libarchive-3.3.3-2.fc30.x86_64                     125/146 
  Installing       : rpm-libs-4.14.2.1-3.fc30.x86_64                    126/146 
  Installing       : rpm-4.14.2.1-3.fc30.x86_64                         127/146 
  Installing       : efi-srpm-macros-4-1.fc30.noarch                    128/146 
  Installing       : gdb-headless-8.2.50.20181130-11.fc30.x86_64        129/146 
  Installing       : rpm-build-libs-4.14.2.1-3.fc30.x86_64              130/146 
  Installing       : rust-srpm-macros-6-1.fc30.noarch                   131/146 
  Installing       : qt5-srpm-macros-5.11.3-1.fc30.noarch               132/146 
  Installing       : python-srpm-macros-3-39.fc30.noarch                133/146 
  Installing       : perl-srpm-macros-1-28.fc29.noarch                  134/146 
  Installing       : openblas-srpm-macros-2-4.fc29.noarch               135/146 
  Installing       : ocaml-srpm-macros-5-4.fc29.noarch                  136/146 
  Installing       : nim-srpm-macros-1-3.fc29.noarch                    137/146 
  Installing       : go-srpm-macros-2-18.fc29.noarch                    138/146 
  Installing       : gnat-srpm-macros-4-4.fc30.noarch                   139/146 
  Installing       : ghc-srpm-macros-1.4.2-8.fc29.noarch                140/146 
  Installing       : fpc-srpm-macros-1.1-5.fc29.noarch                  141/146 
  Installing       : redhat-rpm-config-125-1.fc30.noarch                142/146 
  Installing       : rpm-build-4.14.2.1-3.fc30.x86_64                   143/146 
  Installing       : util-linux-2.33-0.1.fc30.x86_64                    144/146 
  Running scriptlet: util-linux-2.33-0.1.fc30.x86_64                    144/146 
  Installing       : make-1:4.2.1-10.fc29.x86_64                        145/146 
  Running scriptlet: make-1:4.2.1-10.fc29.x86_64                        145/146 
  Installing       : which-2.21-11.fc29.x86_64                          146/146 
  Running scriptlet: filesystem-3.9-2.fc29.x86_64                       146/146 
  Running scriptlet: glibc-common-2.28.9000-27.fc30.x86_64              146/146 
  Running scriptlet: info-6.5-11.fc30.x86_64                            146/146 
  Running scriptlet: glib2-2.58.1-2.fc30.x86_64                         146/146 
  Verifying        : shadow-utils-2:4.6-5.fc30.x86_64                     1/146 
  Verifying        : diffutils-3.6-5.fc29.x86_64                          2/146 
  Verifying        : gzip-1.9-7.fc29.x86_64                               3/146 
  Verifying        : make-1:4.2.1-10.fc29.x86_64                          4/146 
  Verifying        : bash-4.4.23-5.fc30.x86_64                            5/146 
  Verifying        : redhat-rpm-config-125-1.fc30.noarch                  6/146 
  Verifying        : glibc-minimal-langpack-2.28.9000-27.fc30.x86_64      7/146 
  Verifying        : findutils-1:4.6.0-21.fc30.x86_64                     8/146 
  Verifying        : fedora-release-30-0.18.noarch                        9/146 
  Verifying        : sed-4.5-2.fc29.x86_64                               10/146 
  Verifying        : rpm-build-4.14.2.1-3.fc30.x86_64                    11/146 
  Verifying        : grep-3.1-8.fc29.x86_64                              12/146 
  Verifying        : which-2.21-11.fc29.x86_64                           13/146 
  Verifying        : patch-2.7.6-8.fc30.x86_64                           14/146 
  Verifying        : tar-2:1.30-6.fc29.x86_64                            15/146 
  Verifying        : info-6.5-11.fc30.x86_64                             16/146 
  Verifying        : unzip-6.0-42.fc30.x86_64                            17/146 
  Verifying        : cpio-2.12-9.fc29.x86_64                             18/146 
  Verifying        : coreutils-8.30-8.fc30.x86_64                        19/146 
  Verifying        : xz-5.2.4-4.fc30.x86_64                              20/146 
  Verifying        : bzip2-1.0.6-28.fc29.x86_64                          21/146 
  Verifying        : gawk-4.2.1-3.fc29.x86_64                            22/146 
  Verifying        : util-linux-2.33-0.1.fc30.x86_64                     23/146 
  Verifying        : audit-libs-3.0-0.4.20180831git0047a6c.fc30.x86_6    24/146 
  Verifying        : glibc-2.28.9000-27.fc30.x86_64                      25/146 
  Verifying        : libacl-2.2.53-2.fc29.x86_64                         26/146 
  Verifying        : libattr-2.4.48-4.fc30.x86_64                        27/146 
  Verifying        : libselinux-2.8-5.fc30.x86_64                        28/146 
  Verifying        : libsemanage-2.8-7.fc30.x86_64                       29/146 
  Verifying        : libxcrypt-4.4.1-1.fc30.x86_64                       30/146 
  Verifying        : setup-2.12.6-1.fc30.noarch                          31/146 
  Verifying        : guile-5:2.0.14-12.fc29.x86_64                       32/146 
  Verifying        : filesystem-3.9-2.fc29.x86_64                        33/146 
  Verifying        : ncurses-libs-6.1-8.20180923.fc30.x86_64             34/146 
  Verifying        : dwz-0.12-9.fc29.x86_64                              35/146 
  Verifying        : efi-srpm-macros-4-1.fc30.noarch                     36/146 
  Verifying        : file-5.35-2.fc30.x86_64                             37/146 
  Verifying        : fpc-srpm-macros-1.1-5.fc29.noarch                   38/146 
  Verifying        : ghc-srpm-macros-1.4.2-8.fc29.noarch                 39/146 
  Verifying        : gnat-srpm-macros-4-4.fc30.noarch                    40/146 
  Verifying        : go-srpm-macros-2-18.fc29.noarch                     41/146 
  Verifying        : nim-srpm-macros-1-3.fc29.noarch                     42/146 
  Verifying        : ocaml-srpm-macros-5-4.fc29.noarch                   43/146 
  Verifying        : openblas-srpm-macros-2-4.fc29.noarch                44/146 
  Verifying        : perl-srpm-macros-1-28.fc29.noarch                   45/146 
  Verifying        : python-srpm-macros-3-39.fc30.noarch                 46/146 
  Verifying        : qt5-srpm-macros-5.11.3-1.fc30.noarch                47/146 
  Verifying        : rpm-4.14.2.1-3.fc30.x86_64                          48/146 
  Verifying        : rust-srpm-macros-6-1.fc30.noarch                    49/146 
  Verifying        : zip-3.0-23.fc29.x86_64                              50/146 
  Verifying        : glibc-common-2.28.9000-27.fc30.x86_64               51/146 
  Verifying        : fedora-release-common-30-0.18.noarch                52/146 
  Verifying        : binutils-2.31.1-17.fc30.x86_64                      53/146 
  Verifying        : elfutils-0.175-2.fc30.x86_64                        54/146 
  Verifying        : elfutils-libelf-0.175-2.fc30.x86_64                 55/146 
  Verifying        : elfutils-libs-0.175-2.fc30.x86_64                   56/146 
  Verifying        : gdb-headless-8.2.50.20181130-11.fc30.x86_64         57/146 
  Verifying        : popt-1.16-16.fc30.x86_64                            58/146 
  Verifying        : rpm-build-libs-4.14.2.1-3.fc30.x86_64               59/146 
  Verifying        : rpm-libs-4.14.2.1-3.fc30.x86_64                     60/146 
  Verifying        : zstd-1.3.6-1.fc30.x86_64                            61/146 
  Verifying        : pcre-8.42-5.fc30.x86_64                             62/146 
  Verifying        : zlib-1.2.11-14.fc30.x86_64                          63/146 
  Verifying        : bzip2-libs-1.0.6-28.fc29.x86_64                     64/146 
  Verifying        : coreutils-common-8.30-8.fc30.x86_64                 65/146 
  Verifying        : gmp-1:6.1.2-8.fc29.x86_64                           66/146 
  Verifying        : libcap-2.25-12.fc29.x86_64                          67/146 
  Verifying        : ncurses-6.1-8.20180923.fc30.x86_64                  68/146 
  Verifying        : openssl-libs-1:1.1.1-7.fc30.x86_64                  69/146 
  Verifying        : xz-libs-5.2.4-4.fc30.x86_64                         70/146 
  Verifying        : libsigsegv-2.11-6.fc29.x86_64                       71/146 
  Verifying        : mpfr-3.1.6-3.fc30.x86_64                            72/146 
  Verifying        : readline-7.0-12.fc29.x86_64                         73/146 
  Verifying        : libblkid-2.33-0.1.fc30.x86_64                       74/146 
  Verifying        : libcap-ng-0.7.9-5.fc30.x86_64                       75/146 
  Verifying        : libfdisk-2.33-0.1.fc30.x86_64                       76/146 
  Verifying        : libmount-2.33-0.1.fc30.x86_64                       77/146 
  Verifying        : libsmartcols-2.33-0.1.fc30.x86_64                   78/146 
  Verifying        : libutempter-1.1.6-15.fc29.x86_64                    79/146 
  Verifying        : libuuid-2.33-0.1.fc30.x86_64                        80/146 
  Verifying        : pam-1.3.1-14.fc30.x86_64                            81/146 
  Verifying        : systemd-libs-239-9.git9f3aed1.fc30.x86_64           82/146 
  Verifying        : basesystem-11-6.fc29.noarch                         83/146 
  Verifying        : libgcc-8.2.1-6.fc30.x86_64                          84/146 
  Verifying        : libsepol-2.8-3.fc30.x86_64                          85/146 
  Verifying        : pcre2-10.32-4.fc30.x86_64                           86/146 
  Verifying        : gc-7.6.4-4.fc29.x86_64                              87/146 
  Verifying        : libffi-3.1-18.fc29.x86_64                           88/146 
  Verifying        : libtool-ltdl-2.4.6-27.fc30.x86_64                   89/146 
  Verifying        : libunistring-0.9.10-4.fc29.x86_64                   90/146 
  Verifying        : ncurses-base-6.1-8.20180923.fc30.noarch             91/146 
  Verifying        : file-libs-5.35-2.fc30.x86_64                        92/146 
  Verifying        : libarchive-3.3.3-2.fc30.x86_64                      93/146 
  Verifying        : libdb-utils-5.3.28-34.fc30.x86_64                   94/146 
  Verifying        : tzdata-2018g-1.fc30.noarch                          95/146 
  Verifying        : fedora-repos-30-0.2.noarch                          96/146 
  Verifying        : chkconfig-1.11-2.fc30.x86_64                        97/146 
  Verifying        : libstdc++-8.2.1-6.fc30.x86_64                       98/146 
  Verifying        : elfutils-default-yama-scope-0.175-2.fc30.noarch     99/146 
  Verifying        : expat-2.2.6-1.fc30.x86_64                          100/146 
  Verifying        : libbabeltrace-1.5.6-1.fc29.x86_64                  101/146 
  Verifying        : libipt-2.0-1.fc30.x86_64                           102/146 
  Verifying        : python3-libs-3.7.1-4.fc30.x86_64                   103/146 
  Verifying        : libdb-5.3.28-34.fc30.x86_64                        104/146 
  Verifying        : libzstd-1.3.6-1.fc30.x86_64                        105/146 
  Verifying        : lua-libs-5.3.5-2.fc29.x86_64                       106/146 
  Verifying        : ca-certificates-2018.2.26-2.fc30.noarch            107/146 
  Verifying        : crypto-policies-20181122-1.git70769d9.fc30.noarc   108/146 
  Verifying        : cracklib-2.9.6-18.fc30.x86_64                      109/146 
  Verifying        : libnsl2-1.2.0-3.20180605git4a062cf.fc30.x86_64     110/146 
  Verifying        : libtirpc-1.1.4-2.rc2.fc30.x86_64                   111/146 
  Verifying        : libgcrypt-1.8.4-1.fc30.x86_64                      112/146 
  Verifying        : lz4-libs-1.8.2-2.fc29.x86_64                       113/146 
  Verifying        : libatomic_ops-7.6.6-1.fc29.x86_64                  114/146 
  Verifying        : libxml2-2.9.8-4.fc29.x86_64                        115/146 
  Verifying        : fedora-gpg-keys-30-0.2.noarch                      116/146 
  Verifying        : fedora-repos-rawhide-30-0.2.noarch                 117/146 
  Verifying        : glib2-2.58.1-2.fc30.x86_64                         118/146 
  Verifying        : gdbm-libs-1:1.18-1.fc30.x86_64                     119/146 
  Verifying        : python-pip-wheel-18.1-1.fc30.noarch                120/146 
  Verifying        : python-setuptools-wheel-40.4.3-1.fc30.noarch       121/146 
  Verifying        : sqlite-libs-3.26.0-1.fc30.x86_64                   122/146 
  Verifying        : krb5-libs-1.17-1.beta2.1.fc30.x86_64               123/146 
  Verifying        : libcom_err-1.44.4-1.fc30.x86_64                    124/146 
  Verifying        : libgpg-error-1.31-2.fc29.x86_64                    125/146 
  Verifying        : keyutils-libs-1.6-1.fc30.x86_64                    126/146 
  Verifying        : libverto-0.3.0-6.fc29.x86_64                       127/146 
  Verifying        : pkgconf-pkg-config-1.5.4-1.fc30.x86_64             128/146 
  Verifying        : pkgconf-1.5.4-1.fc30.x86_64                        129/146 
  Verifying        : pkgconf-m4-1.5.4-1.fc30.noarch                     130/146 
  Verifying        : libpkgconf-1.5.4-1.fc30.x86_64                     131/146 
  Verifying        : libpwquality-1.4.0-11.fc30.x86_64                  132/146 
  Verifying        : p11-kit-0.23.14-1.fc30.x86_64                      133/146 
  Verifying        : p11-kit-trust-0.23.14-1.fc30.x86_64                134/146 
  Verifying        : libtasn1-4.13-6.fc30.x86_64                        135/146 
  Verifying        : curl-7.63.0-2.fc30.x86_64                          136/146 
  Verifying        : libmetalink-0.1.3-7.fc29.x86_64                    137/146 
  Verifying        : libcurl-7.63.0-2.fc30.x86_64                       138/146 
  Verifying        : brotli-1.0.7-1.fc30.x86_64                         139/146 
  Verifying        : libidn2-2.0.5-2.fc29.x86_64                        140/146 
  Verifying        : libnghttp2-1.35.1-1.fc30.x86_64                    141/146 
  Verifying        : libpsl-0.20.2-5.fc29.x86_64                        142/146 
  Verifying        : libssh-0.8.5-1.fc30.x86_64                         143/146 
  Verifying        : openldap-2.4.46-10.fc30.x86_64                     144/146 
  Verifying        : publicsuffix-list-dafsa-20180723-1.fc29.noarch     145/146 
  Verifying        : cyrus-sasl-lib-2.1.27-0.4rc7.fc30.x86_64           146/146 

Installed:
  bash.x86_64 4.4.23-5.fc30                                                     
  bzip2.x86_64 1.0.6-28.fc29                                                    
  coreutils.x86_64 8.30-8.fc30                                                  
  cpio.x86_64 2.12-9.fc29                                                       
  diffutils.x86_64 3.6-5.fc29                                                   
  fedora-release.noarch 30-0.18                                                 
  findutils.x86_64 1:4.6.0-21.fc30                                              
  gawk.x86_64 4.2.1-3.fc29                                                      
  glibc-minimal-langpack.x86_64 2.28.9000-27.fc30                               
  grep.x86_64 3.1-8.fc29                                                        
  gzip.x86_64 1.9-7.fc29                                                        
  info.x86_64 6.5-11.fc30                                                       
  make.x86_64 1:4.2.1-10.fc29                                                   
  patch.x86_64 2.7.6-8.fc30                                                     
  redhat-rpm-config.noarch 125-1.fc30                                           
  rpm-build.x86_64 4.14.2.1-3.fc30                                              
  sed.x86_64 4.5-2.fc29                                                         
  shadow-utils.x86_64 2:4.6-5.fc30                                              
  tar.x86_64 2:1.30-6.fc29                                                      
  unzip.x86_64 6.0-42.fc30                                                      
  util-linux.x86_64 2.33-0.1.fc30                                               
  which.x86_64 2.21-11.fc29                                                     
  xz.x86_64 5.2.4-4.fc30                                                        
  audit-libs.x86_64 3.0-0.4.20180831git0047a6c.fc30                             
  basesystem.noarch 11-6.fc29                                                   
  binutils.x86_64 2.31.1-17.fc30                                                
  brotli.x86_64 1.0.7-1.fc30                                                    
  bzip2-libs.x86_64 1.0.6-28.fc29                                               
  ca-certificates.noarch 2018.2.26-2.fc30                                       
  chkconfig.x86_64 1.11-2.fc30                                                  
  coreutils-common.x86_64 8.30-8.fc30                                           
  cracklib.x86_64 2.9.6-18.fc30                                                 
  crypto-policies.noarch 20181122-1.git70769d9.fc30                             
  curl.x86_64 7.63.0-2.fc30                                                     
  cyrus-sasl-lib.x86_64 2.1.27-0.4rc7.fc30                                      
  dwz.x86_64 0.12-9.fc29                                                        
  efi-srpm-macros.noarch 4-1.fc30                                               
  elfutils.x86_64 0.175-2.fc30                                                  
  elfutils-default-yama-scope.noarch 0.175-2.fc30                               
  elfutils-libelf.x86_64 0.175-2.fc30                                           
  elfutils-libs.x86_64 0.175-2.fc30                                             
  expat.x86_64 2.2.6-1.fc30                                                     
  fedora-gpg-keys.noarch 30-0.2                                                 
  fedora-release-common.noarch 30-0.18                                          
  fedora-repos.noarch 30-0.2                                                    
  fedora-repos-rawhide.noarch 30-0.2                                            
  file.x86_64 5.35-2.fc30                                                       
  file-libs.x86_64 5.35-2.fc30                                                  
  filesystem.x86_64 3.9-2.fc29                                                  
  fpc-srpm-macros.noarch 1.1-5.fc29                                             
  gc.x86_64 7.6.4-4.fc29                                                        
  gdb-headless.x86_64 8.2.50.20181130-11.fc30                                   
  gdbm-libs.x86_64 1:1.18-1.fc30                                                
  ghc-srpm-macros.noarch 1.4.2-8.fc29                                           
  glib2.x86_64 2.58.1-2.fc30                                                    
  glibc.x86_64 2.28.9000-27.fc30                                                
  glibc-common.x86_64 2.28.9000-27.fc30                                         
  gmp.x86_64 1:6.1.2-8.fc29                                                     
  gnat-srpm-macros.noarch 4-4.fc30                                              
  go-srpm-macros.noarch 2-18.fc29                                               
  guile.x86_64 5:2.0.14-12.fc29                                                 
  keyutils-libs.x86_64 1.6-1.fc30                                               
  krb5-libs.x86_64 1.17-1.beta2.1.fc30                                          
  libacl.x86_64 2.2.53-2.fc29                                                   
  libarchive.x86_64 3.3.3-2.fc30                                                
  libatomic_ops.x86_64 7.6.6-1.fc29                                             
  libattr.x86_64 2.4.48-4.fc30                                                  
  libbabeltrace.x86_64 1.5.6-1.fc29                                             
  libblkid.x86_64 2.33-0.1.fc30                                                 
  libcap.x86_64 2.25-12.fc29                                                    
  libcap-ng.x86_64 0.7.9-5.fc30                                                 
  libcom_err.x86_64 1.44.4-1.fc30                                               
  libcurl.x86_64 7.63.0-2.fc30                                                  
  libdb.x86_64 5.3.28-34.fc30                                                   
  libdb-utils.x86_64 5.3.28-34.fc30                                             
  libfdisk.x86_64 2.33-0.1.fc30                                                 
  libffi.x86_64 3.1-18.fc29                                                     
  libgcc.x86_64 8.2.1-6.fc30                                                    
  libgcrypt.x86_64 1.8.4-1.fc30                                                 
  libgpg-error.x86_64 1.31-2.fc29                                               
  libidn2.x86_64 2.0.5-2.fc29                                                   
  libipt.x86_64 2.0-1.fc30                                                      
  libmetalink.x86_64 0.1.3-7.fc29                                               
  libmount.x86_64 2.33-0.1.fc30                                                 
  libnghttp2.x86_64 1.35.1-1.fc30                                               
  libnsl2.x86_64 1.2.0-3.20180605git4a062cf.fc30                                
  libpkgconf.x86_64 1.5.4-1.fc30                                                
  libpsl.x86_64 0.20.2-5.fc29                                                   
  libpwquality.x86_64 1.4.0-11.fc30                                             
  libselinux.x86_64 2.8-5.fc30                                                  
  libsemanage.x86_64 2.8-7.fc30                                                 
  libsepol.x86_64 2.8-3.fc30                                                    
  libsigsegv.x86_64 2.11-6.fc29                                                 
  libsmartcols.x86_64 2.33-0.1.fc30                                             
  libssh.x86_64 0.8.5-1.fc30                                                    
  libstdc++.x86_64 8.2.1-6.fc30                                                 
  libtasn1.x86_64 4.13-6.fc30                                                   
  libtirpc.x86_64 1.1.4-2.rc2.fc30                                              
  libtool-ltdl.x86_64 2.4.6-27.fc30                                             
  libunistring.x86_64 0.9.10-4.fc29                                             
  libutempter.x86_64 1.1.6-15.fc29                                              
  libuuid.x86_64 2.33-0.1.fc30                                                  
  libverto.x86_64 0.3.0-6.fc29                                                  
  libxcrypt.x86_64 4.4.1-1.fc30                                                 
  libxml2.x86_64 2.9.8-4.fc29                                                   
  libzstd.x86_64 1.3.6-1.fc30                                                   
  lua-libs.x86_64 5.3.5-2.fc29                                                  
  lz4-libs.x86_64 1.8.2-2.fc29                                                  
  mpfr.x86_64 3.1.6-3.fc30                                                      
  ncurses.x86_64 6.1-8.20180923.fc30                                            
  ncurses-base.noarch 6.1-8.20180923.fc30                                       
  ncurses-libs.x86_64 6.1-8.20180923.fc30                                       
  nim-srpm-macros.noarch 1-3.fc29                                               
  ocaml-srpm-macros.noarch 5-4.fc29                                             
  openblas-srpm-macros.noarch 2-4.fc29                                          
  openldap.x86_64 2.4.46-10.fc30                                                
  openssl-libs.x86_64 1:1.1.1-7.fc30                                            
  p11-kit.x86_64 0.23.14-1.fc30                                                 
  p11-kit-trust.x86_64 0.23.14-1.fc30                                           
  pam.x86_64 1.3.1-14.fc30                                                      
  pcre.x86_64 8.42-5.fc30                                                       
  pcre2.x86_64 10.32-4.fc30                                                     
  perl-srpm-macros.noarch 1-28.fc29                                             
  pkgconf.x86_64 1.5.4-1.fc30                                                   
  pkgconf-m4.noarch 1.5.4-1.fc30                                                
  pkgconf-pkg-config.x86_64 1.5.4-1.fc30                                        
  popt.x86_64 1.16-16.fc30                                                      
  publicsuffix-list-dafsa.noarch 20180723-1.fc29                                
  python-pip-wheel.noarch 18.1-1.fc30                                           
  python-setuptools-wheel.noarch 40.4.3-1.fc30                                  
  python-srpm-macros.noarch 3-39.fc30                                           
  python3-libs.x86_64 3.7.1-4.fc30                                              
  qt5-srpm-macros.noarch 5.11.3-1.fc30                                          
  readline.x86_64 7.0-12.fc29                                                   
  rpm.x86_64 4.14.2.1-3.fc30                                                    
  rpm-build-libs.x86_64 4.14.2.1-3.fc30                                         
  rpm-libs.x86_64 4.14.2.1-3.fc30                                               
  rust-srpm-macros.noarch 6-1.fc30                                              
  setup.noarch 2.12.6-1.fc30                                                    
  sqlite-libs.x86_64 3.26.0-1.fc30                                              
  systemd-libs.x86_64 239-9.git9f3aed1.fc30                                     
  tzdata.noarch 2018g-1.fc30                                                    
  xz-libs.x86_64 5.2.4-4.fc30                                                   
  zip.x86_64 3.0-23.fc29                                                        
  zlib.x86_64 1.2.11-14.fc30                                                    
  zstd.x86_64 1.3.6-1.fc30                                                      

Complete!
Finish: dnf install
Start: creating root cache
Finish: creating root cache
Finish: chroot init
INFO: Installed packages:
Start: buildsrpm
Start: rpmbuild -bs
Building target platforms: x86_64
Building for target x86_64
Wrote: /builddir/build/SRPMS/javamail-1.6.3-3.fc30.src.rpm
Finish: rpmbuild -bs
INFO: chroot_scan: 3 files copied to /var/lib/copr-rpmbuild/results/chroot_scan
INFO: /var/lib/mock/838767-fedora-rawhide-x86_64-1545256645.714611/root/var/log/dnf.rpm.log
/var/lib/mock/838767-fedora-rawhide-x86_64-1545256645.714611/root/var/log/dnf.librepo.log
/var/lib/mock/838767-fedora-rawhide-x86_64-1545256645.714611/root/var/log/dnf.log
Finish: buildsrpm
INFO: Done(/tmp/tmp_5_pa9xx/javamail.spec) Config(child) 0 minutes 55 seconds
INFO: Results and/or logs in: /var/lib/copr-rpmbuild/results
INFO: Cleaning up build root ('cleanup_on_success=True')
Start: clean chroot
INFO: unmounting tmpfs.
Finish: clean chroot
Finish: run
Running: unbuffer /usr/bin/mock --rebuild /var/lib/copr-rpmbuild/results/javamail-1.6.3-3.fc30.src.rpm --configdir /var/lib/copr-rpmbuild/results/configs --resultdir /var/lib/copr-rpmbuild/results --uniqueext 1545256702.604392 -r child
WARNING: Could not find required logging config file: /var/lib/copr-rpmbuild/results/configs/logging.ini. Using default...
INFO: mock.py version 1.4.13 starting (python version = 3.6.5)...
Start: init plugins
INFO: tmpfs initialized
INFO: selinux disabled
INFO: chroot_scan: initialized
INFO: compress_logs: initialized
Finish: init plugins
Start: run
INFO: Start(/var/lib/copr-rpmbuild/results/javamail-1.6.3-3.fc30.src.rpm)  Config(838767-fedora-rawhide-x86_64)
Start: clean chroot
Finish: clean chroot
Start: chroot init
INFO: mounting tmpfs at /var/lib/mock/838767-fedora-rawhide-x86_64-1545256702.604392/root.
INFO: calling preinit hooks
INFO: enabled root cache
Start: unpacking root cache
Finish: unpacking root cache
INFO: enabled HW Info plugin
Mock Version: 1.4.13
INFO: Mock Version: 1.4.13
Start: dnf update
'Copr repository'                               1.2 MB/s | 107 kB     00:00    
fedora                                           57 MB/s |  63 MB     00:01    
Last metadata expiration check: 0:00:00 ago on Wed 19 Dec 2018 09:58:26 PM UTC.
Dependencies resolved.
Nothing to do.
Complete!
Finish: dnf update
Finish: chroot init
Start: build phase for javamail-1.6.3-3.fc30.src.rpm
Start: build setup for javamail-1.6.3-3.fc30.src.rpm
Building target platforms: x86_64
Building for target x86_64
Wrote: /builddir/build/SRPMS/javamail-1.6.3-3.fc30.src.rpm
Last metadata expiration check: 0:00:00 ago on Wed 19 Dec 2018 09:58:54 PM UTC.
Dependencies resolved.
================================================================================
 Package                            Arch   Version                 Repository
                                                                           Size
================================================================================
Installing:
 glassfish-hk2-maven-plugins        noarch 2.4.0-11.fc30           fedora  38 k
 glassfish-servlet-api              noarch 3.1.0-15.fc29           fedora  86 k
 jboss-jsp-2.2-api                  noarch 1.0.1-18.fc29           fedora  67 k
 maven-dependency-plugin            noarch 3.1.1-1.fc30            fedora 156 k
 maven-enforcer-plugin              noarch 1.4.1-9.fc29            fedora  34 k
 maven-local                        noarch 5.3.0-3.fc30            fedora 9.8 k
 maven-plugin-build-helper          noarch 1.9.1-8.fc29            fedora  54 k
 maven-plugin-bundle                noarch 3.5.1-1.fc30            fedora 203 k
 maven-source-plugin                noarch 3.0.1-5.fc29            fedora  40 k
Installing dependencies:
 alsa-lib                           x86_64 1.1.7-2.fc30            fedora 402 k
 ant-lib                            noarch 1.10.5-3.fc30           fedora 2.0 M
 antlr-tool                         noarch 2.7.7-55.fc29           fedora 355 k
 aopalliance                        noarch 1.0-18.fc29             fedora  15 k
 apache-commons-cli                 noarch 1.4-5.fc29              fedora  71 k
 apache-commons-codec               noarch 1.11-4.fc29             fedora 281 k
 apache-commons-collections         noarch 3.2.2-10.fc29           fedora 533 k
 apache-commons-compress            noarch 1.18-1.fc30             fedora 521 k
 apache-commons-configuration       noarch 1.10-12.fc29            fedora 354 k
 apache-commons-io                  noarch 1:2.6-4.fc29            fedora 219 k
 apache-commons-lang                noarch 2.6-22.fc29             fedora 279 k
 apache-commons-lang3               noarch 3.8.1-2.fc30            fedora 483 k
 apache-commons-logging             noarch 1.2-14.fc29             fedora  82 k
 apache-ivy                         noarch 2.4.0-15.fc30           fedora 1.1 M
 apr                                x86_64 1.6.5-1.fc30            fedora 106 k
 aqute-bndlib                       noarch 3.5.0-4.fc29            fedora 1.4 M
 atinject                           noarch 1-29.20100611svn86.fc29 fedora  16 k
 avahi-libs                         x86_64 0.7-16.fc29             fedora  59 k
 avalon-framework                   noarch 4.3-21.fc29             fedora  85 k
 avalon-logkit                      noarch 2.1-30.fc29             fedora  80 k
 batik                              noarch 1.10-3.fc30             fedora 7.1 M
 batik-css                          noarch 1.10-3.fc30             fedora 296 k
 beust-jcommander                   noarch 1.71-5.fc29             fedora  84 k
 bsf                                noarch 2.4.0-31.fc30           fedora 106 k
 bsh                                noarch 2.0-13.b6.fc29          fedora 754 k
 cdi-api                            noarch 1.2-9.fc29              fedora 140 k
 compat-openssl10                   x86_64 1:1.0.2o-3.fc29         fedora 1.1 M
 copy-jdk-configs                   noarch 3.7-2.fc29              fedora  25 k
 cups-libs                          x86_64 1:2.2.8-10.fc30         fedora 323 k
 dain-snappy                        noarch 0.4-6.fc29              fedora  67 k
 dbus-libs                          x86_64 1:1.12.12-2.fc30        fedora 146 k
 dejavu-fonts-common                noarch 2.35-7.fc29             fedora  65 k
 dejavu-sans-fonts                  noarch 2.35-7.fc29             fedora 1.5 M
 extra166y                          noarch 1.7.0-10.fc29           fedora 552 k
 felix-bundlerepository             noarch 2.0.10-4.fc29           fedora 161 k
 felix-utils                        noarch 1.10.4-3.fc29           fedora 110 k
 fontbox                            noarch 2.0.9-4.fc30            fedora 1.4 M
 fontconfig                         x86_64 2.13.1-4.fc30           fedora 235 k
 fontpackages-filesystem            noarch 1.44-22.fc29            fedora 7.7 k
 fop                                noarch 2.2-3.fc30              fedora 4.7 M
 freetype                           x86_64 2.9.1-6.fc30            fedora 357 k
 geronimo-annotation                noarch 1.0-24.fc29             fedora  22 k
 giflib                             x86_64 5.1.4-2.fc29            fedora  47 k
 glassfish-el-api                   noarch 3.0.1-0.9.b08.fc29      fedora 103 k
 glassfish-hk2-api                  noarch 2.4.0-11.fc30           fedora 170 k
 glassfish-hk2-core                 noarch 2.4.0-11.fc30           fedora 122 k
 glassfish-hk2-locator              noarch 2.4.0-11.fc30           fedora 187 k
 glassfish-hk2-utils                noarch 2.4.0-11.fc30           fedora 108 k
 gnutls                             x86_64 3.6.5-1.fc30            fedora 861 k
 google-guice                       noarch 4.1-13.fc30             fedora 465 k
 gpars                              noarch 1.2.1-12.fc29           fedora 569 k
 groovy-lib                         noarch 2.4.8-7.fc29            fedora  14 M
 guava20                            noarch 20.0-8.fc29             fedora 2.1 M
 hamcrest-core                      noarch 1.3-24.fc29             fedora  50 k
 hawtjni-runtime                    noarch 1.16-3.fc29             fedora  39 k
 httpcomponents-client              noarch 4.5.6-2.fc30            fedora 713 k
 httpcomponents-core                noarch 4.4.10-4.fc30           fedora 633 k
 jakarta-commons-httpclient         noarch 1:3.1-29.fc29           fedora 240 k
 jansi                              noarch 1.17.1-2.fc29           fedora  76 k
 jansi-native                       x86_64 1.7-7.fc29              fedora  71 k
 java-1.8.0-openjdk                 x86_64 1:1.8.0.191.b12-12.fc30 fedora 241 k
 java-1.8.0-openjdk-devel           x86_64 1:1.8.0.191.b12-12.fc30 fedora 9.8 M
 java-1.8.0-openjdk-headless        x86_64 1:1.8.0.191.b12-12.fc30 fedora  32 M
 javapackages-filesystem            noarch 5.3.0-3.fc30            fedora  12 k
 javapackages-local                 noarch 5.3.0-3.fc30            fedora  69 k
 javapackages-tools                 noarch 5.3.0-3.fc30            fedora  33 k
 javassist                          noarch 3.18.1-9.fc29           fedora 678 k
 jboss-el-2.2-api                   noarch 1.0.2-9.fc29            fedora  59 k
 jboss-interceptors-1.2-api         noarch 1.0.0-9.fc29            fedora  31 k
 jboss-servlet-3.0-api              noarch 1.0.2-10.fc29           fedora 192 k
 jcsp                               noarch 1.1-0.10.rc5.fc29       fedora 597 k
 jline                              noarch 2.14.6-3.fc29           fedora 151 k
 junit                              noarch 1:4.12-10.fc29          fedora 293 k
 jzlib                              noarch 1.1.3-9.fc29            fedora  79 k
 kxml                               noarch 2.3.0-17.fc29           fedora  46 k
 libX11                             x86_64 1.6.7-1.fc30            fedora 593 k
 libX11-common                      noarch 1.6.7-1.fc30            fedora 155 k
 libXau                             x86_64 1.0.8-14.fc29           fedora  29 k
 libXcomposite                      x86_64 0.4.4-15.fc29           fedora  22 k
 libXext                            x86_64 1.3.3-10.fc29           fedora  38 k
 libXi                              x86_64 1.7.9-8.fc29            fedora  38 k
 libXrender                         x86_64 0.9.10-8.fc29           fedora  26 k
 libXtst                            x86_64 1.2.3-8.fc29            fedora  20 k
 libfontenc                         x86_64 1.1.3-9.fc29            fedora  30 k
 libjpeg-turbo                      x86_64 2.0.0-1.fc29            fedora 158 k
 libpng                             x86_64 2:1.6.35-1.fc30         fedora 106 k
 libxcb                             x86_64 1.13.1-1.fc30           fedora 200 k
 libxslt                            x86_64 1.1.32-3.fc29           fedora 243 k
 lksctp-tools                       x86_64 1.0.16-10.fc29          fedora  92 k
 log4j12                            noarch 1.2.17-23.fc29          fedora 458 k
 lua                                x86_64 5.3.5-2.fc29            fedora 185 k
 lua-posix                          x86_64 33.3.1-11.fc29          fedora 173 k
 maven-archiver                     noarch 3.2.0-3.fc29            fedora  36 k
 maven-artifact                     noarch 2.2.1-59.fc29           fedora  82 k
 maven-artifact-manager             noarch 2.2.1-59.fc29           fedora  77 k
 maven-artifact-transfer            noarch 1:0.9.0-5.fc29          fedora  80 k
 maven-common-artifact-filters      noarch 3.0.1-5.fc29            fedora  58 k
 maven-compiler-plugin              noarch 3.8.0-1.fc29            fedora  69 k
 maven-dependency-analyzer          noarch 1.10-1.fc30             fedora  45 k
 maven-dependency-tree              noarch 3.0-6.fc29              fedora  41 k
 maven-doxia-core                   noarch 1.7-9.fc29              fedora 159 k
 maven-doxia-logging-api            noarch 1.7-9.fc29              fedora  23 k
 maven-doxia-module-apt             noarch 1.7-9.fc29              fedora  57 k
 maven-doxia-module-fml             noarch 1.7-9.fc29              fedora  45 k
 maven-doxia-module-fo              noarch 1.7-9.fc29              fedora  65 k
 maven-doxia-module-markdown        noarch 1.7-9.fc29              fedora  22 k
 maven-doxia-module-xdoc            noarch 1.7-9.fc29              fedora  43 k
 maven-doxia-module-xhtml           noarch 1.7-9.fc29              fedora  24 k
 maven-doxia-sink-api               noarch 1.7-9.fc29              fedora  19 k
 maven-doxia-sitetools              noarch 1.7.5-3.fc29            fedora 183 k
 maven-enforcer-api                 noarch 1.4.1-9.fc29            fedora  23 k
 maven-enforcer-rules               noarch 1.4.1-9.fc29            fedora 101 k
 maven-file-management              noarch 1:3.0.0-6.fc29          fedora  45 k
 maven-filtering                    noarch 3.1.1-6.fc29            fedora  59 k
 maven-invoker                      noarch 2.2-8.fc29              fedora  41 k
 maven-jar-plugin                   noarch 3.1.0-2.fc29            fedora  37 k
 maven-javadoc-plugin               noarch 3.0.1-2.fc29            fedora 249 k
 maven-lib                          noarch 1:3.5.4-7.fc30          fedora 1.4 M
 maven-model                        noarch 2.2.1-59.fc29           fedora 126 k
 maven-osgi                         noarch 1:0.2.0-16.fc29         fedora  25 k
 maven-plugin-annotations           noarch 3.5.1-4.fc29            fedora  22 k
 maven-plugin-registry              noarch 2.2.1-59.fc29           fedora  38 k
 maven-plugin-testing-harness       noarch 3.3.0-13.fc29           fedora  56 k
 maven-profile                      noarch 2.2.1-59.fc29           fedora  43 k
 maven-project                      noarch 2.2.1-59.fc29           fedora 162 k
 maven-reporting-api                noarch 1:3.0-15.fc29           fedora  22 k
 maven-reporting-impl               noarch 3.0.0-4.fc29            fedora  31 k
 maven-resolver-api                 noarch 1:1.3.1-1.fc30          fedora 139 k
 maven-resolver-impl                noarch 1:1.3.1-1.fc30          fedora 172 k
 maven-resolver-spi                 noarch 1:1.3.1-1.fc30          fedora  40 k
 maven-resolver-util                noarch 1:1.3.1-1.fc30          fedora 147 k
 maven-resources-plugin             noarch 3.1.0-3.fc29            fedora  40 k
 maven-settings                     noarch 2.2.1-59.fc29           fedora  57 k
 maven-shared-incremental           noarch 1.1-15.fc29             fedora  26 k
 maven-shared-io                    noarch 1:3.0.0-6.fc29          fedora  48 k
 maven-shared-utils                 noarch 3.2.1-0.2.fc29          fedora 162 k
 maven-surefire                     noarch 2.22.0-3.fc29           fedora 783 k
 maven-surefire-plugin              noarch 2.22.0-3.fc29           fedora  34 k
 maven-surefire-provider-junit      noarch 2.22.0-3.fc29           fedora 222 k
 maven-surefire-provider-testng     noarch 2.22.0-3.fc29           fedora  59 k
 maven-verifier                     noarch 1.6-7.fc29              fedora  52 k
 maven-wagon-provider-api           noarch 3.2.0-1.fc30            fedora  56 k
 multiverse                         noarch 0.7.0-9.fc29            fedora 229 k
 nettle                             x86_64 3.4.1rc1-1.fc30         fedora 293 k
 netty-tcnative                     x86_64 1.1.30-12.fc29          fedora 121 k
 netty3                             noarch 3.10.6-5.fc29           fedora 1.2 M
 nspr                               x86_64 4.20.0-1.fc30           fedora 122 k
 nss                                x86_64 3.41.0-1.fc30           fedora 633 k
 nss-softokn                        x86_64 3.41.0-1.fc30           fedora 362 k
 nss-softokn-freebl                 x86_64 3.41.0-1.fc30           fedora 215 k
 nss-sysinit                        x86_64 3.41.0-1.fc30           fedora  20 k
 nss-util                           x86_64 3.41.0-1.fc30           fedora  83 k
 objectweb-asm                      noarch 7.0-1.fc30              fedora 370 k
 osgi-annotation                    noarch 7.0.0-1.fc30            fedora  23 k
 osgi-compendium                    noarch 6.0.0-6.fc29            fedora 274 k
 osgi-core                          noarch 6.0.0-7.fc29            fedora 156 k
 parboiled                          noarch 1.1.6-14.fc29           fedora 280 k
 pegdown                            noarch 1.4.2-13.fc29           fedora  84 k
 plexus-archiver                    noarch 3.6.0-2.fc29            fedora 177 k
 plexus-build-api                   noarch 0.0.7-21.fc29           fedora  20 k
 plexus-cipher                      noarch 1.7-15.fc29             fedora  25 k
 plexus-classworlds                 noarch 2.5.2-10.fc29           fedora  60 k
 plexus-compiler                    noarch 2.8.2-3.fc29            fedora  65 k
 plexus-component-api               noarch 1.0-0.25.alpha15.fc29   fedora  30 k
 plexus-containers-component-annotations
                                    noarch 1.7.1-8.fc29            fedora  18 k
 plexus-containers-container-default
                                    noarch 1.7.1-8.fc29            fedora 199 k
 plexus-i18n                        noarch 1.0-0.12.b10.4.fc29     fedora  20 k
 plexus-interactivity-api           noarch 1.0-0.27.alpha6.fc29    fedora  17 k
 plexus-interpolation               noarch 1.22-10.fc29            fedora  75 k
 plexus-io                          noarch 3.0.0-3.fc29            fedora  72 k
 plexus-languages                   noarch 0.9.10-3.fc29           fedora  45 k
 plexus-sec-dispatcher              noarch 1.4-26.fc29             fedora  33 k
 plexus-utils                       noarch 3.1.0-3.fc29            fedora 254 k
 plexus-velocity                    noarch 1.2-5.fc29              fedora  20 k
 procps-ng                          x86_64 3.3.15-4.fc29           fedora 321 k
 publicsuffix-list                  noarch 20180723-1.fc29         fedora  77 k
 python3                            x86_64 3.7.1-4.fc30            fedora  39 k
 python3-javapackages               noarch 5.3.0-3.fc30            fedora  74 k
 python3-lxml                       x86_64 4.2.4-1.fc30            fedora 1.4 M
 python3-six                        noarch 1.11.0-6.fc29           fedora  34 k
 qdox                               noarch 2.0-3.M9.fc29           fedora 292 k
 sisu-inject                        noarch 1:0.3.3-6.fc29          fedora 332 k
 sisu-plexus                        noarch 1:0.3.3-6.fc29          fedora 173 k
 slf4j                              noarch 1.7.25-5.fc29           fedora  69 k
 ttmkfdir                           x86_64 3.0.9-55.fc29           fedora  53 k
 tzdata-java                        noarch 2018g-1.fc30            fedora 150 k
 velocity                           noarch 1.7-24.fc29             fedora 428 k
 xalan-j2                           noarch 2.7.1-38.fc29           fedora 1.9 M
 xbean                              noarch 4.9-1.fc29              fedora 422 k
 xerces-j2                          noarch 2.12.0-1.fc30           fedora 1.2 M
 xml-commons-apis                   noarch 1.4.01-26.fc29          fedora 227 k
 xml-commons-resolver               noarch 1.2-26.fc29             fedora 110 k
 xmlgraphics-commons                noarch 2.2-2.fc29              fedora 617 k
 xmlunit                            noarch 1.6-8.fc29              fedora 363 k
 xmvn-api                           noarch 3.0.0-22.fc30           fedora  78 k
 xmvn-connector-aether              noarch 3.0.0-22.fc30           fedora  33 k
 xmvn-core                          noarch 3.0.0-22.fc30           fedora  54 k
 xmvn-install                       noarch 3.0.0-22.fc30           fedora  81 k
 xmvn-minimal                       noarch 3.0.0-22.fc30           fedora  21 k
 xmvn-mojo                          noarch 3.0.0-22.fc30           fedora  64 k
 xmvn-resolve                       noarch 3.0.0-22.fc30           fedora  26 k
 xmvn-subst                         noarch 3.0.0-22.fc30           fedora  23 k
 xorg-x11-font-utils                x86_64 1:7.5-40.fc29           fedora  95 k
 xorg-x11-fonts-Type1               noarch 7.5-20.fc29             fedora 517 k
 xpp3                               noarch 1.1.4-19.c.fc29         fedora 291 k
 xpp3-minimal                       noarch 1.1.4-19.c.fc29         fedora  34 k
 xstream                            noarch 1.4.9-8.fc29            fedora 496 k
 xz-java                            noarch 1.8-3.fc29              fedora 103 k

Transaction Summary
================================================================================
Install  217 Packages

Total download size: 116 M
Installed size: 269 M
Downloading Packages:
(1/217): maven-local-5.3.0-3.fc30.noarch.rpm    236 kB/s | 9.8 kB     00:00    
(2/217): maven-dependency-plugin-3.1.1-1.fc30.n  19 MB/s | 156 kB     00:00    
(3/217): jboss-jsp-2.2-api-1.0.1-18.fc29.noarch 1.3 MB/s |  67 kB     00:00    
(4/217): maven-enforcer-plugin-1.4.1-9.fc29.noa 8.2 MB/s |  34 kB     00:00    
(5/217): maven-source-plugin-3.0.1-5.fc29.noarc 7.4 MB/s |  40 kB     00:00    
(6/217): maven-plugin-build-helper-1.9.1-8.fc29  12 MB/s |  54 kB     00:00    
(7/217): maven-plugin-bundle-3.5.1-1.fc30.noarc 3.2 MB/s | 203 kB     00:00    
(8/217): glassfish-hk2-maven-plugins-2.4.0-11.f 7.0 MB/s |  38 kB     00:00    
(9/217): glassfish-servlet-api-3.1.0-15.fc29.no  17 MB/s |  86 kB     00:00    
(10/217): javapackages-tools-5.3.0-3.fc30.noarc 9.2 MB/s |  33 kB     00:00    
(11/217): javapackages-local-5.3.0-3.fc30.noarc  11 MB/s |  69 kB     00:00    
(12/217): maven-compiler-plugin-3.8.0-1.fc29.no  14 MB/s |  69 kB     00:00    
(13/217): maven-jar-plugin-3.1.0-2.fc29.noarch. 9.0 MB/s |  37 kB     00:00    
(14/217): junit-4.12-10.fc29.noarch.rpm          27 MB/s | 293 kB     00:00    
(15/217): maven-resources-plugin-3.1.0-3.fc29.n 8.3 MB/s |  40 kB     00:00    
(16/217): maven-surefire-plugin-2.22.0-3.fc29.n 9.8 MB/s |  34 kB     00:00    
(17/217): maven-javadoc-plugin-3.0.1-2.fc29.noa  21 MB/s | 249 kB     00:00    
(18/217): maven-surefire-provider-testng-2.22.0  11 MB/s |  59 kB     00:00    
(19/217): xmvn-connector-aether-3.0.0-22.fc30.n  10 MB/s |  33 kB     00:00    
(20/217): maven-surefire-provider-junit-2.22.0-  19 MB/s | 222 kB     00:00    
(21/217): xmvn-minimal-3.0.0-22.fc30.noarch.rpm 4.4 MB/s |  21 kB     00:00    
(22/217): xmvn-mojo-3.0.0-22.fc30.noarch.rpm     12 MB/s |  64 kB     00:00    
(23/217): jboss-el-2.2-api-1.0.2-9.fc29.noarch.  15 MB/s |  59 kB     00:00    
(24/217): jboss-servlet-3.0-api-1.0.2-10.fc29.n  21 MB/s | 192 kB     00:00    
(25/217): felix-bundlerepository-2.0.10-4.fc29.  19 MB/s | 161 kB     00:00    
(26/217): felix-utils-1.10.4-3.fc29.noarch.rpm   15 MB/s | 110 kB     00:00    
(27/217): javapackages-filesystem-5.3.0-3.fc30. 1.4 MB/s |  12 kB     00:00    
(28/217): aqute-bndlib-3.5.0-4.fc29.noarch.rpm   34 MB/s | 1.4 MB     00:00    
(29/217): kxml-2.3.0-17.fc29.noarch.rpm         3.6 MB/s |  46 kB     00:00    
(30/217): maven-archiver-3.2.0-3.fc29.noarch.rp 8.1 MB/s |  36 kB     00:00    
(31/217): maven-dependency-tree-3.0-6.fc29.noar 9.7 MB/s |  41 kB     00:00    
(32/217): maven-doxia-sink-api-1.7-9.fc29.noarc 4.5 MB/s |  19 kB     00:00    
(33/217): maven-doxia-sitetools-1.7.5-3.fc29.no  17 MB/s | 183 kB     00:00    
(34/217): maven-reporting-impl-3.0.0-4.fc29.noa 5.9 MB/s |  31 kB     00:00    
(35/217): osgi-core-6.0.0-7.fc29.noarch.rpm      13 MB/s | 156 kB     00:00    
(36/217): plexus-build-api-0.0.7-21.fc29.noarch 3.2 MB/s |  20 kB     00:00    
(37/217): maven-lib-3.5.4-7.fc30.noarch.rpm      34 MB/s | 1.4 MB     00:00    
(38/217): plexus-utils-3.1.0-3.fc29.noarch.rpm   12 MB/s | 254 kB     00:00    
(39/217): xpp3-1.1.4-19.c.fc29.noarch.rpm        21 MB/s | 291 kB     00:00    
(40/217): apache-commons-io-2.6-4.fc29.noarch.r  12 MB/s | 219 kB     00:00    
(41/217): apache-commons-collections-3.2.2-10.f  23 MB/s | 533 kB     00:00    
(42/217): maven-artifact-transfer-0.9.0-5.fc29. 8.0 MB/s |  80 kB     00:00    
(43/217): apache-commons-lang-2.6-22.fc29.noarc  15 MB/s | 279 kB     00:00    
(44/217): maven-common-artifact-filters-3.0.1-5 9.0 MB/s |  58 kB     00:00    
(45/217): maven-dependency-analyzer-1.10-1.fc30 7.5 MB/s |  45 kB     00:00    
(46/217): maven-file-management-3.0.0-6.fc29.no 7.8 MB/s |  45 kB     00:00    
(47/217): maven-reporting-api-3.0-15.fc29.noarc 2.6 MB/s |  22 kB     00:00    
(48/217): maven-shared-utils-3.2.1-0.2.fc29.noa  16 MB/s | 162 kB     00:00    
(49/217): plexus-classworlds-2.5.2-10.fc29.noar 7.1 MB/s |  60 kB     00:00    
(50/217): plexus-archiver-3.6.0-2.fc29.noarch.r  13 MB/s | 177 kB     00:00    
(51/217): plexus-io-3.0.0-3.fc29.noarch.rpm     9.3 MB/s |  72 kB     00:00    
(52/217): maven-enforcer-api-1.4.1-9.fc29.noarc 3.1 MB/s |  23 kB     00:00    
(53/217): maven-enforcer-rules-1.4.1-9.fc29.noa  14 MB/s | 101 kB     00:00    
(54/217): maven-plugin-testing-harness-3.3.0-13 6.1 MB/s |  56 kB     00:00    
(55/217): maven-artifact-2.2.1-59.fc29.noarch.r 6.2 MB/s |  82 kB     00:00    
(56/217): maven-model-2.2.1-59.fc29.noarch.rpm  8.3 MB/s | 126 kB     00:00    
(57/217): bsh-2.0-13.b6.fc29.noarch.rpm          20 MB/s | 754 kB     00:00    
(58/217): glassfish-hk2-core-2.4.0-11.fc30.noar  11 MB/s | 122 kB     00:00    
(59/217): maven-project-2.2.1-59.fc29.noarch.rp 8.9 MB/s | 162 kB     00:00    
(60/217): maven-osgi-0.2.0-16.fc29.noarch.rpm   3.2 MB/s |  25 kB     00:00    
(61/217): python3-javapackages-5.3.0-3.fc30.noa 6.5 MB/s |  74 kB     00:00    
(62/217): xmvn-install-3.0.0-22.fc30.noarch.rpm 7.5 MB/s |  81 kB     00:00    
(63/217): xmvn-resolve-3.0.0-22.fc30.noarch.rpm 2.7 MB/s |  26 kB     00:00    
(64/217): xmvn-subst-3.0.0-22.fc30.noarch.rpm   2.2 MB/s |  23 kB     00:00    
(65/217): hamcrest-core-1.3-24.fc29.noarch.rpm  4.4 MB/s |  50 kB     00:00    
(66/217): maven-shared-incremental-1.1-15.fc29. 2.4 MB/s |  26 kB     00:00    
(67/217): plexus-compiler-2.8.2-3.fc29.noarch.r 5.2 MB/s |  65 kB     00:00    
(68/217): plexus-languages-0.9.10-3.fc29.noarch 4.1 MB/s |  45 kB     00:00    
(69/217): apache-commons-lang3-3.8.1-2.fc30.noa  12 MB/s | 483 kB     00:00    
(70/217): httpcomponents-client-4.5.6-2.fc30.no  13 MB/s | 713 kB     00:00    
(71/217): maven-invoker-2.2-8.fc29.noarch.rpm   3.7 MB/s |  41 kB     00:00    
(72/217): maven-wagon-provider-api-3.2.0-1.fc30 4.0 MB/s |  56 kB     00:00    
(73/217): plexus-interactivity-api-1.0-0.27.alp 1.2 MB/s |  17 kB     00:00    
(74/217): qdox-2.0-3.M9.fc29.noarch.rpm          10 MB/s | 292 kB     00:00    
(75/217): maven-filtering-3.1.1-6.fc29.noarch.r 4.3 MB/s |  59 kB     00:00    
(76/217): plexus-interpolation-1.22-10.fc29.noa 6.5 MB/s |  75 kB     00:00    
(77/217): maven-surefire-2.22.0-3.fc29.noarch.r  14 MB/s | 783 kB     00:00    
(78/217): xmvn-api-3.0.0-22.fc30.noarch.rpm     5.4 MB/s |  78 kB     00:00    
(79/217): xmvn-core-3.0.0-22.fc30.noarch.rpm    7.7 MB/s |  54 kB     00:00    
(80/217): java-1.8.0-openjdk-headless-1.8.0.191  43 MB/s |  32 MB     00:00    
(81/217): apache-commons-cli-1.4-5.fc29.noarch. 479 kB/s |  71 kB     00:00    
(82/217): atinject-1-29.20100611svn86.fc29.noar 3.2 MB/s |  16 kB     00:00    
(83/217): google-guice-4.1-13.fc30.noarch.rpm    24 MB/s | 465 kB     00:00    
(84/217): maven-resolver-api-1.3.1-1.fc30.noarc 9.7 MB/s | 139 kB     00:00    
(85/217): maven-resolver-impl-1.3.1-1.fc30.noar  15 MB/s | 172 kB     00:00    
(86/217): maven-resolver-spi-1.3.1-1.fc30.noarc 8.2 MB/s |  40 kB     00:00    
(87/217): guava20-20.0-8.fc29.noarch.rpm         33 MB/s | 2.1 MB     00:00    
(88/217): maven-resolver-util-1.3.1-1.fc30.noar 8.4 MB/s | 147 kB     00:00    
(89/217): plexus-cipher-1.7-15.fc29.noarch.rpm  5.7 MB/s |  25 kB     00:00    
(90/217): plexus-containers-component-annotatio 5.3 MB/s |  18 kB     00:00    
(91/217): plexus-sec-dispatcher-1.4-26.fc29.noa 8.1 MB/s |  33 kB     00:00    
(92/217): sisu-inject-0.3.3-6.fc29.noarch.rpm    36 MB/s | 332 kB     00:00    
(93/217): sisu-plexus-0.3.3-6.fc29.noarch.rpm    14 MB/s | 173 kB     00:00    
(94/217): java-1.8.0-openjdk-devel-1.8.0.191.b1  15 MB/s | 9.8 MB     00:00    
(95/217): copy-jdk-configs-3.7-2.fc29.noarch.rp 536 kB/s |  25 kB     00:00    
(96/217): slf4j-1.7.25-5.fc29.noarch.rpm        1.2 MB/s |  69 kB     00:00    
(97/217): libjpeg-turbo-2.0.0-1.fc29.x86_64.rpm  19 MB/s | 158 kB     00:00    
(98/217): lksctp-tools-1.0.16-10.fc29.x86_64.rp  13 MB/s |  92 kB     00:00    
(99/217): freetype-2.9.1-6.fc30.x86_64.rpm       24 MB/s | 357 kB     00:00    
(100/217): nspr-4.20.0-1.fc30.x86_64.rpm         12 MB/s | 122 kB     00:00    
(101/217): nss-util-3.41.0-1.fc30.x86_64.rpm     16 MB/s |  83 kB     00:00    
(102/217): nss-softokn-3.41.0-1.fc30.x86_64.rpm  26 MB/s | 362 kB     00:00    
(103/217): nss-3.41.0-1.fc30.x86_64.rpm          28 MB/s | 633 kB     00:00    
(104/217): osgi-annotation-7.0.0-1.fc30.noarch. 4.4 MB/s |  23 kB     00:00    
(105/217): tzdata-java-2018g-1.fc30.noarch.rpm   12 MB/s | 150 kB     00:00    
(106/217): maven-doxia-logging-api-1.7-9.fc29.n 4.7 MB/s |  23 kB     00:00    
(107/217): maven-doxia-core-1.7-9.fc29.noarch.r  27 MB/s | 159 kB     00:00    
(108/217): osgi-compendium-6.0.0-6.fc29.noarch.  22 MB/s | 274 kB     00:00    
(109/217): maven-doxia-module-apt-1.7-9.fc29.no 7.6 MB/s |  57 kB     00:00    
(110/217): maven-doxia-module-fml-1.7-9.fc29.no 9.2 MB/s |  45 kB     00:00    
(111/217): maven-doxia-module-fo-1.7-9.fc29.noa  13 MB/s |  65 kB     00:00    
(112/217): maven-doxia-module-markdown-1.7-9.fc 5.2 MB/s |  22 kB     00:00    
(113/217): maven-doxia-module-xdoc-1.7-9.fc29.n 8.9 MB/s |  43 kB     00:00    
(114/217): maven-doxia-module-xhtml-1.7-9.fc29. 5.5 MB/s |  24 kB     00:00    
(115/217): plexus-i18n-1.0-0.12.b10.4.fc29.noar 6.3 MB/s |  20 kB     00:00    
(116/217): plexus-containers-container-default-  20 MB/s | 199 kB     00:00    
(117/217): plexus-velocity-1.2-5.fc29.noarch.rp 3.1 MB/s |  20 kB     00:00    
(118/217): velocity-1.7-24.fc29.noarch.rpm       24 MB/s | 428 kB     00:00    
(119/217): xml-commons-apis-1.4.01-26.fc29.noar  15 MB/s | 227 kB     00:00    
(120/217): geronimo-annotation-1.0-24.fc29.noar 2.8 MB/s |  22 kB     00:00    
(121/217): apache-commons-codec-1.11-4.fc29.noa  23 MB/s | 281 kB     00:00    
(122/217): maven-shared-io-3.0.0-6.fc29.noarch.  12 MB/s |  48 kB     00:00    
(123/217): objectweb-asm-7.0-1.fc30.noarch.rpm   23 MB/s | 370 kB     00:00    
(124/217): dain-snappy-0.4-6.fc29.noarch.rpm     13 MB/s |  67 kB     00:00    
(125/217): apache-commons-compress-1.18-1.fc30.  32 MB/s | 521 kB     00:00    
(126/217): xalan-j2-2.7.1-38.fc29.noarch.rpm     32 MB/s | 1.9 MB     00:00    
(127/217): xz-java-1.8-3.fc29.noarch.rpm        5.8 MB/s | 103 kB     00:00    
(128/217): bsf-2.4.0-31.fc30.noarch.rpm         7.7 MB/s | 106 kB     00:00    
(129/217): maven-artifact-manager-2.2.1-59.fc29  17 MB/s |  77 kB     00:00    
(130/217): jline-2.14.6-3.fc29.noarch.rpm        18 MB/s | 151 kB     00:00    
(131/217): maven-plugin-registry-2.2.1-59.fc29. 6.8 MB/s |  38 kB     00:00    
(132/217): maven-profile-2.2.1-59.fc29.noarch.r 8.0 MB/s |  43 kB     00:00    
(133/217): maven-settings-2.2.1-59.fc29.noarch.  11 MB/s |  57 kB     00:00    
(134/217): glassfish-hk2-locator-2.4.0-11.fc30.  26 MB/s | 187 kB     00:00    
(135/217): glassfish-hk2-utils-2.4.0-11.fc30.no  15 MB/s | 108 kB     00:00    
(136/217): java-1.8.0-openjdk-1.8.0.191.b12-12.  21 MB/s | 241 kB     00:00    
(137/217): python3-six-1.11.0-6.fc29.noarch.rpm 4.6 MB/s |  34 kB     00:00    
(138/217): beust-jcommander-1.71-5.fc29.noarch.  11 MB/s |  84 kB     00:00    
(139/217): apache-commons-logging-1.2-14.fc29.n 9.1 MB/s |  82 kB     00:00    
(140/217): publicsuffix-list-20180723-1.fc29.no  13 MB/s |  77 kB     00:00    
(141/217): plexus-component-api-1.0-0.25.alpha1 8.9 MB/s |  30 kB     00:00    
(142/217): httpcomponents-core-4.4.10-4.fc30.no  36 MB/s | 633 kB     00:00    
(143/217): maven-plugin-annotations-3.5.1-4.fc2 3.5 MB/s |  22 kB     00:00    
(144/217): python3-lxml-4.2.4-1.fc30.x86_64.rpm  33 MB/s | 1.4 MB     00:00    
(145/217): aopalliance-1.0-18.fc29.noarch.rpm   1.8 MB/s |  15 kB     00:00    
(146/217): maven-verifier-1.6-7.fc29.noarch.rpm 4.4 MB/s |  52 kB     00:00    
(147/217): cdi-api-1.2-9.fc29.noarch.rpm         20 MB/s | 140 kB     00:00    
(148/217): lua-posix-33.3.1-11.fc29.x86_64.rpm   21 MB/s | 173 kB     00:00    
(149/217): libpng-1.6.35-1.fc30.x86_64.rpm       14 MB/s | 106 kB     00:00    
(150/217): nss-sysinit-3.41.0-1.fc30.x86_64.rpm 4.4 MB/s |  20 kB     00:00    
(151/217): nss-softokn-freebl-3.41.0-1.fc30.x86  28 MB/s | 215 kB     00:00    
(152/217): xmlunit-1.6-8.fc29.noarch.rpm         24 MB/s | 363 kB     00:00    
(153/217): apache-commons-configuration-1.10-12  19 MB/s | 354 kB     00:00    
(154/217): pegdown-1.4.2-13.fc29.noarch.rpm     7.3 MB/s |  84 kB     00:00    
(155/217): log4j12-1.2.17-23.fc29.noarch.rpm     16 MB/s | 458 kB     00:00    
(156/217): xbean-4.9-1.fc29.noarch.rpm           19 MB/s | 422 kB     00:00    
(157/217): jansi-1.17.1-2.fc29.noarch.rpm       7.1 MB/s |  76 kB     00:00    
(158/217): glassfish-hk2-api-2.4.0-11.fc30.noar  18 MB/s | 170 kB     00:00    
(159/217): xerces-j2-2.12.0-1.fc30.noarch.rpm    26 MB/s | 1.2 MB     00:00    
(160/217): javassist-3.18.1-9.fc29.noarch.rpm    27 MB/s | 678 kB     00:00    
(161/217): alsa-lib-1.1.7-2.fc30.x86_64.rpm      27 MB/s | 402 kB     00:00    
(162/217): fontconfig-2.13.1-4.fc30.x86_64.rpm   25 MB/s | 235 kB     00:00    
(163/217): giflib-5.1.4-2.fc29.x86_64.rpm       8.7 MB/s |  47 kB     00:00    
(164/217): fop-2.2-3.fc30.noarch.rpm             36 MB/s | 4.7 MB     00:00    
(165/217): libXcomposite-0.4.4-15.fc29.x86_64.r 778 kB/s |  22 kB     00:00    
(166/217): libX11-1.6.7-1.fc30.x86_64.rpm        16 MB/s | 593 kB     00:00    
(167/217): libXext-1.3.3-10.fc29.x86_64.rpm     4.0 MB/s |  38 kB     00:00    
(168/217): libXi-1.7.9-8.fc29.x86_64.rpm        4.3 MB/s |  38 kB     00:00    
(169/217): libXrender-0.9.10-8.fc29.x86_64.rpm  3.9 MB/s |  26 kB     00:00    
(170/217): libXtst-1.2.3-8.fc29.x86_64.rpm      5.0 MB/s |  20 kB     00:00    
(171/217): xorg-x11-fonts-Type1-7.5-20.fc29.noa  44 MB/s | 517 kB     00:00    
(172/217): glassfish-el-api-3.0.1-0.9.b08.fc29.  10 MB/s | 103 kB     00:00    
(173/217): libxslt-1.1.32-3.fc29.x86_64.rpm      19 MB/s | 243 kB     00:00    
(174/217): jboss-interceptors-1.2-api-1.0.0-9.f 5.7 MB/s |  31 kB     00:00    
(175/217): avalon-framework-4.3-21.fc29.noarch.  16 MB/s |  85 kB     00:00    
(176/217): jakarta-commons-httpclient-3.1-29.fc  12 MB/s | 240 kB     00:00    
(177/217): fontbox-2.0.9-4.fc30.noarch.rpm       43 MB/s | 1.4 MB     00:00    
(178/217): parboiled-1.1.6-14.fc29.noarch.rpm    25 MB/s | 280 kB     00:00    
(179/217): xmlgraphics-commons-2.2-2.fc29.noarc  19 MB/s | 617 kB     00:00    
(180/217): xml-commons-resolver-1.2-26.fc29.noa  12 MB/s | 110 kB     00:00    
(181/217): hawtjni-runtime-1.16-3.fc29.noarch.r 5.0 MB/s |  39 kB     00:00    
(182/217): jansi-native-1.7-7.fc29.x86_64.rpm   6.2 MB/s |  71 kB     00:00    
(183/217): fontpackages-filesystem-1.44-22.fc29 964 kB/s | 7.7 kB     00:00    
(184/217): libX11-common-1.6.7-1.fc30.noarch.rp 8.5 MB/s | 155 kB     00:00    
(185/217): libxcb-1.13.1-1.fc30.x86_64.rpm       10 MB/s | 200 kB     00:00    
(186/217): ttmkfdir-3.0.9-55.fc29.x86_64.rpm    4.8 MB/s |  53 kB     00:00    
(187/217): xorg-x11-font-utils-7.5-40.fc29.x86_ 7.8 MB/s |  95 kB     00:00    
(188/217): avalon-logkit-2.1-30.fc29.noarch.rpm 6.4 MB/s |  80 kB     00:00    
(189/217): batik-css-1.10-3.fc30.noarch.rpm      11 MB/s | 296 kB     00:00    
(190/217): batik-1.10-3.fc30.noarch.rpm          29 MB/s | 7.1 MB     00:00    
(191/217): antlr-tool-2.7.7-55.fc29.noarch.rpm   22 MB/s | 355 kB     00:00    
(192/217): groovy-lib-2.4.8-7.fc29.noarch.rpm    47 MB/s |  14 MB     00:00    
(193/217): apache-ivy-2.4.0-15.fc30.noarch.rpm   13 MB/s | 1.1 MB     00:00    
(194/217): gpars-1.2.1-12.fc29.noarch.rpm        26 MB/s | 569 kB     00:00    
(195/217): libXau-1.0.8-14.fc29.x86_64.rpm      5.9 MB/s |  29 kB     00:00    
(196/217): ant-lib-1.10.5-3.fc30.noarch.rpm      11 MB/s | 2.0 MB     00:00    
(197/217): libfontenc-1.1.3-9.fc29.x86_64.rpm   2.7 MB/s |  30 kB     00:00    
(198/217): xstream-1.4.9-8.fc29.noarch.rpm       19 MB/s | 496 kB     00:00    
(199/217): jcsp-1.1-0.10.rc5.fc29.noarch.rpm     39 MB/s | 597 kB     00:00    
(200/217): multiverse-0.7.0-9.fc29.noarch.rpm    17 MB/s | 229 kB     00:00    
(201/217): extra166y-1.7.0-10.fc29.noarch.rpm    22 MB/s | 552 kB     00:00    
(202/217): xpp3-minimal-1.1.4-19.c.fc29.noarch. 5.3 MB/s |  34 kB     00:00    
(203/217): jzlib-1.1.3-9.fc29.noarch.rpm        9.4 MB/s |  79 kB     00:00    
(204/217): netty-tcnative-1.1.30-12.fc29.x86_64  14 MB/s | 121 kB     00:00    
(205/217): apr-1.6.5-1.fc30.x86_64.rpm           17 MB/s | 106 kB     00:00    
(206/217): netty3-3.10.6-5.fc29.noarch.rpm       41 MB/s | 1.2 MB     00:00    
(207/217): procps-ng-3.3.15-4.fc29.x86_64.rpm    25 MB/s | 321 kB     00:00    
(208/217): compat-openssl10-1.0.2o-3.fc29.x86_6  22 MB/s | 1.1 MB     00:00    
(209/217): cups-libs-2.2.8-10.fc30.x86_64.rpm    13 MB/s | 323 kB     00:00    
(210/217): python3-3.7.1-4.fc30.x86_64.rpm      695 kB/s |  39 kB     00:00    
(211/217): avahi-libs-0.7-16.fc29.x86_64.rpm    5.7 MB/s |  59 kB     00:00    
(212/217): dbus-libs-1.12.12-2.fc30.x86_64.rpm   15 MB/s | 146 kB     00:00    
(213/217): gnutls-3.6.5-1.fc30.x86_64.rpm        46 MB/s | 861 kB     00:00    
(214/217): lua-5.3.5-2.fc29.x86_64.rpm           20 MB/s | 185 kB     00:00    
(215/217): nettle-3.4.1rc1-1.fc30.x86_64.rpm     13 MB/s | 293 kB     00:00    
(216/217): dejavu-fonts-common-2.35-7.fc29.noar 7.5 MB/s |  65 kB     00:00    
(217/217): dejavu-sans-fonts-2.35-7.fc29.noarch  59 MB/s | 1.5 MB     00:00    
--------------------------------------------------------------------------------
Total                                            60 MB/s | 116 MB     00:01     
Running transaction check
Transaction check succeeded.
Running transaction test
Transaction test succeeded.
Running transaction
  Running scriptlet: copy-jdk-configs-3.7-2.fc29.noarch                     1/1 
  Running scriptlet: java-1.8.0-openjdk-headless-1:1.8.0.191.b12-12.fc30.   1/1 
  Preparing        :                                                        1/1 
  Installing       : javapackages-filesystem-5.3.0-3.fc30.noarch          1/217 
  Installing       : nspr-4.20.0-1.fc30.x86_64                            2/217 
  Running scriptlet: nspr-4.20.0-1.fc30.x86_64                            2/217 
  Installing       : nss-util-3.41.0-1.fc30.x86_64                        3/217 
  Installing       : python3-3.7.1-4.fc30.x86_64                          4/217 
  Installing       : fontpackages-filesystem-1.44-22.fc29.noarch          5/217 
  Installing       : libpng-2:1.6.35-1.fc30.x86_64                        6/217 
  Installing       : freetype-2.9.1-6.fc30.x86_64                         7/217 
  Installing       : libjpeg-turbo-2.0.0-1.fc29.x86_64                    8/217 
  Installing       : ttmkfdir-3.0.9-55.fc29.x86_64                        9/217 
  Installing       : dejavu-fonts-common-2.35-7.fc29.noarch              10/217 
  Installing       : dejavu-sans-fonts-2.35-7.fc29.noarch                11/217 
  Installing       : fontconfig-2.13.1-4.fc30.x86_64                     12/217 
  Running scriptlet: fontconfig-2.13.1-4.fc30.x86_64                     12/217 
  Installing       : python3-six-1.11.0-6.fc29.noarch                    13/217 
  Installing       : nss-softokn-freebl-3.41.0-1.fc30.x86_64             14/217 
  Installing       : nss-softokn-3.41.0-1.fc30.x86_64                    15/217 
  Installing       : nss-sysinit-3.41.0-1.fc30.x86_64                    16/217 
  Installing       : nss-3.41.0-1.fc30.x86_64                            17/217 
  Running scriptlet: nss-3.41.0-1.fc30.x86_64                            17/217 
Setting system policy to DEFAULT
  Installing       : lua-5.3.5-2.fc29.x86_64                             18/217 
  Installing       : nettle-3.4.1rc1-1.fc30.x86_64                       19/217 
  Installing       : gnutls-3.6.5-1.fc30.x86_64                          20/217 
  Installing       : dbus-libs-1:1.12.12-2.fc30.x86_64                   21/217 
  Installing       : avahi-libs-0.7-16.fc29.x86_64                       22/217 
  Installing       : cups-libs-1:2.2.8-10.fc30.x86_64                    23/217 
  Installing       : procps-ng-3.3.15-4.fc29.x86_64                      24/217 
  Installing       : compat-openssl10-1:1.0.2o-3.fc29.x86_64             25/217 
  Running scriptlet: compat-openssl10-1:1.0.2o-3.fc29.x86_64             25/217 
  Installing       : apr-1.6.5-1.fc30.x86_64                             26/217 
  Running scriptlet: apr-1.6.5-1.fc30.x86_64                             26/217 
  Installing       : libfontenc-1.1.3-9.fc29.x86_64                      27/217 
  Installing       : xorg-x11-font-utils-1:7.5-40.fc29.x86_64            28/217 
  Installing       : xorg-x11-fonts-Type1-7.5-20.fc29.noarch             29/217 
  Running scriptlet: xorg-x11-fonts-Type1-7.5-20.fc29.noarch             29/217 
  Installing       : libXau-1.0.8-14.fc29.x86_64                         30/217 
  Installing       : libxcb-1.13.1-1.fc30.x86_64                         31/217 
  Installing       : libX11-common-1.6.7-1.fc30.noarch                   32/217 
  Installing       : libX11-1.6.7-1.fc30.x86_64                          33/217 
  Installing       : libXext-1.3.3-10.fc29.x86_64                        34/217 
  Installing       : libXi-1.7.9-8.fc29.x86_64                           35/217 
  Installing       : libXtst-1.2.3-8.fc29.x86_64                         36/217 
  Installing       : libXcomposite-0.4.4-15.fc29.x86_64                  37/217 
  Installing       : libXrender-0.9.10-8.fc29.x86_64                     38/217 
  Installing       : libxslt-1.1.32-3.fc29.x86_64                        39/217 
  Installing       : python3-lxml-4.2.4-1.fc30.x86_64                    40/217 
  Installing       : python3-javapackages-5.3.0-3.fc30.noarch            41/217 
  Installing       : giflib-5.1.4-2.fc29.x86_64                          42/217 
  Installing       : alsa-lib-1.1.7-2.fc30.x86_64                        43/217 
  Running scriptlet: alsa-lib-1.1.7-2.fc30.x86_64                        43/217 
  Installing       : lua-posix-33.3.1-11.fc29.x86_64                     44/217 
  Installing       : copy-jdk-configs-3.7-2.fc29.noarch                  45/217 
  Installing       : publicsuffix-list-20180723-1.fc29.noarch            46/217 
  Installing       : tzdata-java-2018g-1.fc30.noarch                     47/217 
  Installing       : lksctp-tools-1.0.16-10.fc29.x86_64                  48/217 
  Running scriptlet: lksctp-tools-1.0.16-10.fc29.x86_64                  48/217 
  Installing       : java-1.8.0-openjdk-headless-1:1.8.0.191.b12-12.f    49/217 
  Running scriptlet: java-1.8.0-openjdk-headless-1:1.8.0.191.b12-12.f    49/217 
  Installing       : javapackages-tools-5.3.0-3.fc30.noarch              50/217 
  Installing       : plexus-utils-3.1.0-3.fc29.noarch                    51/217 
  Installing       : plexus-containers-component-annotations-1.7.1-8.    52/217 
  Installing       : apache-commons-io-1:2.6-4.fc29.noarch               53/217 
  Installing       : maven-shared-utils-3.2.1-0.2.fc29.noarch            54/217 
  Installing       : plexus-interpolation-1.22-10.fc29.noarch            55/217 
  Installing       : apache-commons-logging-1.2-14.fc29.noarch           56/217 
  Installing       : atinject-1-29.20100611svn86.fc29.noarch             57/217 
  Installing       : slf4j-1.7.25-5.fc29.noarch                          58/217 
  Installing       : xml-commons-apis-1.4.01-26.fc29.noarch              59/217 
  Installing       : objectweb-asm-7.0-1.fc30.noarch                     60/217 
  Installing       : apache-commons-lang-2.6-22.fc29.noarch              61/217 
  Installing       : plexus-classworlds-2.5.2-10.fc29.noarch             62/217 
  Installing       : xmvn-api-3.0.0-22.fc30.noarch                       63/217 
  Installing       : xmvn-core-3.0.0-22.fc30.noarch                      64/217 
  Installing       : maven-model-2.2.1-59.fc29.noarch                    65/217 
  Installing       : maven-wagon-provider-api-3.2.0-1.fc30.noarch        66/217 
  Installing       : apache-commons-collections-3.2.2-10.fc29.noarch     67/217 
  Installing       : apache-commons-lang3-3.8.1-2.fc30.noarch            68/217 
  Installing       : maven-resolver-api-1:1.3.1-1.fc30.noarch            69/217 
  Installing       : maven-resolver-util-1:1.3.1-1.fc30.noarch           70/217 
  Installing       : maven-artifact-2.2.1-59.fc29.noarch                 71/217 
  Installing       : osgi-core-6.0.0-7.fc29.noarch                       72/217 
  Installing       : guava20-20.0-8.fc29.noarch                          73/217 
  Installing       : maven-dependency-tree-3.0-6.fc29.noarch             74/217 
  Installing       : maven-resolver-spi-1:1.3.1-1.fc30.noarch            75/217 
  Installing       : glassfish-hk2-utils-2.4.0-11.fc30.noarch            76/217 
  Installing       : xpp3-1.1.4-19.c.fc29.noarch                         77/217 
  Installing       : apache-commons-cli-1.4-5.fc29.noarch                78/217 
  Installing       : plexus-cipher-1.7-15.fc29.noarch                    79/217 
  Installing       : apache-commons-codec-1.11-4.fc29.noarch             80/217 
  Installing       : beust-jcommander-1.71-5.fc29.noarch                 81/217 
  Installing       : aopalliance-1.0-18.fc29.noarch                      82/217 
  Installing       : google-guice-4.1-13.fc30.noarch                     83/217 
  Installing       : plexus-sec-dispatcher-1.4-26.fc29.noarch            84/217 
  Installing       : maven-resolver-impl-1:1.3.1-1.fc30.noarch           85/217 
  Installing       : velocity-1.7-24.fc29.noarch                         86/217 
  Installing       : xmvn-connector-aether-3.0.0-22.fc30.noarch          87/217 
  Installing       : xmlgraphics-commons-2.2-2.fc29.noarch               88/217 
  Installing       : plexus-io-3.0.0-3.fc29.noarch                       89/217 
  Installing       : plexus-build-api-0.0.7-21.fc29.noarch               90/217 
  Installing       : felix-utils-1.10.4-3.fc29.noarch                    91/217 
  Installing       : qdox-2.0-3.M9.fc29.noarch                           92/217 
  Installing       : plexus-languages-0.9.10-3.fc29.noarch               93/217 
  Installing       : osgi-compendium-6.0.0-6.fc29.noarch                 94/217 
  Installing       : log4j12-1.2.17-23.fc29.noarch                       95/217 
  Running scriptlet: log4j12-1.2.17-23.fc29.noarch                       95/217 
  Installing       : hawtjni-runtime-1.16-3.fc29.noarch                  96/217 
  Installing       : apache-commons-compress-1.18-1.fc30.noarch          97/217 
  Installing       : java-1.8.0-openjdk-1:1.8.0.191.b12-12.fc30.x86_6    98/217 
  Running scriptlet: java-1.8.0-openjdk-1:1.8.0.191.b12-12.fc30.x86_6    98/217 
  Installing       : httpcomponents-core-4.4.10-4.fc30.noarch            99/217 
  Installing       : httpcomponents-client-4.5.6-2.fc30.noarch          100/217 
  Installing       : java-1.8.0-openjdk-devel-1:1.8.0.191.b12-12.fc30   101/217 
  Running scriptlet: java-1.8.0-openjdk-devel-1:1.8.0.191.b12-12.fc30   101/217 
  Installing       : xmvn-install-3.0.0-22.fc30.noarch                  102/217 
  Installing       : jansi-native-1.7-7.fc29.x86_64                     103/217 
  Installing       : jansi-1.17.1-2.fc29.noarch                         104/217 
  Installing       : jline-2.14.6-3.fc29.noarch                         105/217 
  Installing       : felix-bundlerepository-2.0.10-4.fc29.noarch        106/217 
  Installing       : glassfish-hk2-api-2.4.0-11.fc30.noarch             107/217 
  Installing       : xmvn-resolve-3.0.0-22.fc30.noarch                  108/217 
  Installing       : xmvn-subst-3.0.0-22.fc30.noarch                    109/217 
  Installing       : javapackages-local-5.3.0-3.fc30.noarch             110/217 
  Installing       : jakarta-commons-httpclient-1:3.1-29.fc29.noarch    111/217 
  Installing       : kxml-2.3.0-17.fc29.noarch                          112/217 
  Installing       : jcsp-1.1-0.10.rc5.fc29.noarch                      113/217 
  Installing       : xmvn-mojo-3.0.0-22.fc30.noarch                     114/217 
  Installing       : plexus-component-api-1.0-0.25.alpha15.fc29.noarc   115/217 
  Installing       : plexus-interactivity-api-1.0-0.27.alpha6.fc29.no   116/217 
  Installing       : apache-commons-configuration-1.10-12.fc29.noarch   117/217 
  Installing       : parboiled-1.1.6-14.fc29.noarch                     118/217 
  Installing       : pegdown-1.4.2-13.fc29.noarch                       119/217 
  Installing       : bsf-2.4.0-31.fc30.noarch                           120/217 
  Installing       : bsh-2.0-13.b6.fc29.noarch                          121/217 
  Installing       : fontbox-2.0.9-4.fc30.noarch                        122/217 
  Installing       : maven-invoker-2.2-8.fc29.noarch                    123/217 
  Installing       : plexus-compiler-2.8.2-3.fc29.noarch                124/217 
  Installing       : jboss-el-2.2-api-1.0.2-9.fc29.noarch               125/217 
  Installing       : jboss-servlet-3.0-api-1.0.2-10.fc29.noarch         126/217 
  Installing       : hamcrest-core-1.3-24.fc29.noarch                   127/217 
  Installing       : junit-1:4.12-10.fc29.noarch                        128/217 
  Installing       : maven-verifier-1.6-7.fc29.noarch                   129/217 
  Installing       : geronimo-annotation-1.0-24.fc29.noarch             130/217 
  Installing       : dain-snappy-0.4-6.fc29.noarch                      131/217 
  Installing       : xz-java-1.8-3.fc29.noarch                          132/217 
  Installing       : plexus-archiver-3.6.0-2.fc29.noarch                133/217 
  Installing       : maven-plugin-testing-harness-3.3.0-13.fc29.noarc   134/217 
  Installing       : javassist-3.18.1-9.fc29.noarch                     135/217 
  Installing       : glassfish-hk2-locator-2.4.0-11.fc30.noarch         136/217 
  Installing       : glassfish-hk2-core-2.4.0-11.fc30.noarch            137/217 
  Installing       : glassfish-el-api-3.0.1-0.9.b08.fc29.noarch         138/217 
  Installing       : jboss-interceptors-1.2-api-1.0.0-9.fc29.noarch     139/217 
  Installing       : cdi-api-1.2-9.fc29.noarch                          140/217 
  Installing       : sisu-inject-1:0.3.3-6.fc29.noarch                  141/217 
  Installing       : sisu-plexus-1:0.3.3-6.fc29.noarch                  142/217 
  Installing       : xmvn-minimal-3.0.0-22.fc30.noarch                  143/217 
  Installing       : maven-lib-1:3.5.4-7.fc30.noarch                    144/217 
  Installing       : maven-common-artifact-filters-3.0.1-5.fc29.noarc   145/217 
  Installing       : maven-archiver-3.2.0-3.fc29.noarch                 146/217 
  Installing       : maven-artifact-transfer-1:0.9.0-5.fc29.noarch      147/217 
  Installing       : maven-jar-plugin-3.1.0-2.fc29.noarch               148/217 
  Installing       : maven-shared-incremental-1.1-15.fc29.noarch        149/217 
  Installing       : maven-compiler-plugin-3.8.0-1.fc29.noarch          150/217 
  Installing       : maven-filtering-3.1.1-6.fc29.noarch                151/217 
  Installing       : maven-resources-plugin-3.1.0-3.fc29.noarch         152/217 
  Installing       : maven-shared-io-1:3.0.0-6.fc29.noarch              153/217 
  Installing       : maven-file-management-1:3.0.0-6.fc29.noarch        154/217 
  Installing       : xml-commons-resolver-1.2-26.fc29.noarch            155/217 
  Installing       : xalan-j2-2.7.1-38.fc29.noarch                      156/217 
  Running scriptlet: xalan-j2-2.7.1-38.fc29.noarch                      156/217 
  Installing       : xerces-j2-2.12.0-1.fc30.noarch                     157/217 
  Running scriptlet: xerces-j2-2.12.0-1.fc30.noarch                     157/217 
  Installing       : batik-css-1.10-3.fc30.noarch                       158/217 
  Installing       : batik-1.10-3.fc30.noarch                           159/217 
  Installing       : xmlunit-1.6-8.fc29.noarch                          160/217 
  Installing       : avalon-logkit-2.1-30.fc29.noarch                   161/217 
  Installing       : avalon-framework-4.3-21.fc29.noarch                162/217 
  Installing       : fop-2.2-3.fc30.noarch                              163/217 
  Installing       : antlr-tool-2.7.7-55.fc29.noarch                    164/217 
  Installing       : extra166y-1.7.0-10.fc29.noarch                     165/217 
  Installing       : multiverse-0.7.0-9.fc29.noarch                     166/217 
  Installing       : xpp3-minimal-1.1.4-19.c.fc29.noarch                167/217 
  Installing       : xstream-1.4.9-8.fc29.noarch                        168/217 
  Installing       : jzlib-1.1.3-9.fc29.noarch                          169/217 
  Installing       : netty-tcnative-1.1.30-12.fc29.x86_64               170/217 
  Installing       : netty3-3.10.6-5.fc29.noarch                        171/217 
  Installing       : osgi-annotation-7.0.0-1.fc30.noarch                172/217 
  Installing       : aqute-bndlib-3.5.0-4.fc29.noarch                   173/217 
  Installing       : ant-lib-1.10.5-3.fc30.noarch                       174/217 
  Installing       : apache-ivy-2.4.0-15.fc30.noarch                    175/217 
  Installing       : groovy-lib-2.4.8-7.fc29.noarch                     176/217 
  Installing       : gpars-1.2.1-12.fc29.noarch                         177/217 
  Installing       : xbean-4.9-1.fc29.noarch                            178/217 
  Installing       : plexus-containers-container-default-1.7.1-8.fc29   179/217 
  Installing       : maven-doxia-logging-api-1.7-9.fc29.noarch          180/217 
  Installing       : maven-doxia-sink-api-1.7-9.fc29.noarch             181/217 
  Installing       : maven-doxia-core-1.7-9.fc29.noarch                 182/217 
  Installing       : maven-reporting-api-1:3.0-15.fc29.noarch           183/217 
  Installing       : maven-doxia-module-xhtml-1.7-9.fc29.noarch         184/217 
  Installing       : maven-enforcer-api-1.4.1-9.fc29.noarch             185/217 
  Installing       : plexus-i18n-1.0-0.12.b10.4.fc29.noarch             186/217 
  Installing       : maven-plugin-registry-2.2.1-59.fc29.noarch         187/217 
  Installing       : maven-plugin-annotations-3.5.1-4.fc29.noarch       188/217 
  Installing       : maven-surefire-2.22.0-3.fc29.noarch                189/217 
  Installing       : maven-surefire-plugin-2.22.0-3.fc29.noarch         190/217 
  Installing       : maven-surefire-provider-junit-2.22.0-3.fc29.noar   191/217 
  Installing       : maven-surefire-provider-testng-2.22.0-3.fc29.noa   192/217 
  Installing       : maven-enforcer-rules-1.4.1-9.fc29.noarch           193/217 
  Installing       : maven-doxia-module-markdown-1.7-9.fc29.noarch      194/217 
  Installing       : maven-doxia-module-apt-1.7-9.fc29.noarch           195/217 
  Installing       : maven-doxia-module-fml-1.7-9.fc29.noarch           196/217 
  Installing       : maven-doxia-module-fo-1.7-9.fc29.noarch            197/217 
  Installing       : maven-doxia-module-xdoc-1.7-9.fc29.noarch          198/217 
  Installing       : plexus-velocity-1.2-5.fc29.noarch                  199/217 
  Installing       : maven-doxia-sitetools-1.7.5-3.fc29.noarch          200/217 
  Installing       : maven-reporting-impl-3.0.0-4.fc29.noarch           201/217 
  Installing       : maven-javadoc-plugin-3.0.1-2.fc29.noarch           202/217 
  Installing       : maven-artifact-manager-2.2.1-59.fc29.noarch        203/217 
  Installing       : maven-profile-2.2.1-59.fc29.noarch                 204/217 
  Installing       : maven-settings-2.2.1-59.fc29.noarch                205/217 
  Installing       : maven-project-2.2.1-59.fc29.noarch                 206/217 
  Installing       : maven-dependency-analyzer-1.10-1.fc30.noarch       207/217 
  Installing       : maven-osgi-1:0.2.0-16.fc29.noarch                  208/217 
  Installing       : glassfish-hk2-maven-plugins-2.4.0-11.fc30.noarch   209/217 
  Installing       : maven-dependency-plugin-3.1.1-1.fc30.noarch        210/217 
  Installing       : maven-plugin-build-helper-1.9.1-8.fc29.noarch      211/217 
  Installing       : maven-local-5.3.0-3.fc30.noarch                    212/217 
  Installing       : maven-plugin-bundle-3.5.1-1.fc30.noarch            213/217 
  Installing       : maven-enforcer-plugin-1.4.1-9.fc29.noarch          214/217 
  Installing       : maven-source-plugin-3.0.1-5.fc29.noarch            215/217 
  Installing       : jboss-jsp-2.2-api-1.0.1-18.fc29.noarch             216/217 
  Installing       : glassfish-servlet-api-3.1.0-15.fc29.noarch         217/217 
  Running scriptlet: copy-jdk-configs-3.7-2.fc29.noarch                 217/217 
  Running scriptlet: java-1.8.0-openjdk-1:1.8.0.191.b12-12.fc30.x86_6   217/217 
  Running scriptlet: java-1.8.0-openjdk-devel-1:1.8.0.191.b12-12.fc30   217/217 
  Running scriptlet: glassfish-servlet-api-3.1.0-15.fc29.noarch         217/217 
  Running scriptlet: fontconfig-2.13.1-4.fc30.x86_64                    217/217 
  Verifying        : maven-local-5.3.0-3.fc30.noarch                      1/217 
  Verifying        : jboss-jsp-2.2-api-1.0.1-18.fc29.noarch               2/217 
  Verifying        : maven-plugin-bundle-3.5.1-1.fc30.noarch              3/217 
  Verifying        : maven-dependency-plugin-3.1.1-1.fc30.noarch          4/217 
  Verifying        : maven-enforcer-plugin-1.4.1-9.fc29.noarch            5/217 
  Verifying        : maven-source-plugin-3.0.1-5.fc29.noarch              6/217 
  Verifying        : maven-plugin-build-helper-1.9.1-8.fc29.noarch        7/217 
  Verifying        : glassfish-hk2-maven-plugins-2.4.0-11.fc30.noarch     8/217 
  Verifying        : glassfish-servlet-api-3.1.0-15.fc29.noarch           9/217 
  Verifying        : javapackages-local-5.3.0-3.fc30.noarch              10/217 
  Verifying        : javapackages-tools-5.3.0-3.fc30.noarch              11/217 
  Verifying        : junit-1:4.12-10.fc29.noarch                         12/217 
  Verifying        : maven-compiler-plugin-3.8.0-1.fc29.noarch           13/217 
  Verifying        : maven-jar-plugin-3.1.0-2.fc29.noarch                14/217 
  Verifying        : maven-javadoc-plugin-3.0.1-2.fc29.noarch            15/217 
  Verifying        : maven-resources-plugin-3.1.0-3.fc29.noarch          16/217 
  Verifying        : maven-surefire-plugin-2.22.0-3.fc29.noarch          17/217 
  Verifying        : maven-surefire-provider-junit-2.22.0-3.fc29.noar    18/217 
  Verifying        : maven-surefire-provider-testng-2.22.0-3.fc29.noa    19/217 
  Verifying        : xmvn-connector-aether-3.0.0-22.fc30.noarch          20/217 
  Verifying        : xmvn-minimal-3.0.0-22.fc30.noarch                   21/217 
  Verifying        : xmvn-mojo-3.0.0-22.fc30.noarch                      22/217 
  Verifying        : java-1.8.0-openjdk-headless-1:1.8.0.191.b12-12.f    23/217 
  Verifying        : jboss-el-2.2-api-1.0.2-9.fc29.noarch                24/217 
  Verifying        : jboss-servlet-3.0-api-1.0.2-10.fc29.noarch          25/217 
  Verifying        : aqute-bndlib-3.5.0-4.fc29.noarch                    26/217 
  Verifying        : felix-bundlerepository-2.0.10-4.fc29.noarch         27/217 
  Verifying        : felix-utils-1.10.4-3.fc29.noarch                    28/217 
  Verifying        : javapackages-filesystem-5.3.0-3.fc30.noarch         29/217 
  Verifying        : kxml-2.3.0-17.fc29.noarch                           30/217 
  Verifying        : maven-archiver-3.2.0-3.fc29.noarch                  31/217 
  Verifying        : maven-dependency-tree-3.0-6.fc29.noarch             32/217 
  Verifying        : maven-doxia-sink-api-1.7-9.fc29.noarch              33/217 
  Verifying        : maven-doxia-sitetools-1.7.5-3.fc29.noarch           34/217 
  Verifying        : maven-lib-1:3.5.4-7.fc30.noarch                     35/217 
  Verifying        : maven-reporting-impl-3.0.0-4.fc29.noarch            36/217 
  Verifying        : osgi-core-6.0.0-7.fc29.noarch                       37/217 
  Verifying        : plexus-build-api-0.0.7-21.fc29.noarch               38/217 
  Verifying        : plexus-utils-3.1.0-3.fc29.noarch                    39/217 
  Verifying        : xpp3-1.1.4-19.c.fc29.noarch                         40/217 
  Verifying        : apache-commons-collections-3.2.2-10.fc29.noarch     41/217 
  Verifying        : apache-commons-io-1:2.6-4.fc29.noarch               42/217 
  Verifying        : apache-commons-lang-2.6-22.fc29.noarch              43/217 
  Verifying        : maven-artifact-transfer-1:0.9.0-5.fc29.noarch       44/217 
  Verifying        : maven-common-artifact-filters-3.0.1-5.fc29.noarc    45/217 
  Verifying        : maven-dependency-analyzer-1.10-1.fc30.noarch        46/217 
  Verifying        : maven-file-management-1:3.0.0-6.fc29.noarch         47/217 
  Verifying        : maven-reporting-api-1:3.0-15.fc29.noarch            48/217 
  Verifying        : maven-shared-utils-3.2.1-0.2.fc29.noarch            49/217 
  Verifying        : plexus-archiver-3.6.0-2.fc29.noarch                 50/217 
  Verifying        : plexus-classworlds-2.5.2-10.fc29.noarch             51/217 
  Verifying        : plexus-io-3.0.0-3.fc29.noarch                       52/217 
  Verifying        : maven-enforcer-api-1.4.1-9.fc29.noarch              53/217 
  Verifying        : maven-enforcer-rules-1.4.1-9.fc29.noarch            54/217 
  Verifying        : maven-plugin-testing-harness-3.3.0-13.fc29.noarc    55/217 
  Verifying        : bsh-2.0-13.b6.fc29.noarch                           56/217 
  Verifying        : maven-artifact-2.2.1-59.fc29.noarch                 57/217 
  Verifying        : maven-model-2.2.1-59.fc29.noarch                    58/217 
  Verifying        : maven-project-2.2.1-59.fc29.noarch                  59/217 
  Verifying        : glassfish-hk2-core-2.4.0-11.fc30.noarch             60/217 
  Verifying        : maven-osgi-1:0.2.0-16.fc29.noarch                   61/217 
  Verifying        : java-1.8.0-openjdk-devel-1:1.8.0.191.b12-12.fc30    62/217 
  Verifying        : python3-javapackages-5.3.0-3.fc30.noarch            63/217 
  Verifying        : xmvn-install-3.0.0-22.fc30.noarch                   64/217 
  Verifying        : xmvn-resolve-3.0.0-22.fc30.noarch                   65/217 
  Verifying        : xmvn-subst-3.0.0-22.fc30.noarch                     66/217 
  Verifying        : hamcrest-core-1.3-24.fc29.noarch                    67/217 
  Verifying        : maven-shared-incremental-1.1-15.fc29.noarch         68/217 
  Verifying        : plexus-compiler-2.8.2-3.fc29.noarch                 69/217 
  Verifying        : plexus-languages-0.9.10-3.fc29.noarch               70/217 
  Verifying        : apache-commons-lang3-3.8.1-2.fc30.noarch            71/217 
  Verifying        : httpcomponents-client-4.5.6-2.fc30.noarch           72/217 
  Verifying        : maven-invoker-2.2-8.fc29.noarch                     73/217 
  Verifying        : maven-wagon-provider-api-3.2.0-1.fc30.noarch        74/217 
  Verifying        : plexus-interactivity-api-1.0-0.27.alpha6.fc29.no    75/217 
  Verifying        : qdox-2.0-3.M9.fc29.noarch                           76/217 
  Verifying        : maven-filtering-3.1.1-6.fc29.noarch                 77/217 
  Verifying        : plexus-interpolation-1.22-10.fc29.noarch            78/217 
  Verifying        : maven-surefire-2.22.0-3.fc29.noarch                 79/217 
  Verifying        : xmvn-api-3.0.0-22.fc30.noarch                       80/217 
  Verifying        : xmvn-core-3.0.0-22.fc30.noarch                      81/217 
  Verifying        : apache-commons-cli-1.4-5.fc29.noarch                82/217 
  Verifying        : atinject-1-29.20100611svn86.fc29.noarch             83/217 
  Verifying        : google-guice-4.1-13.fc30.noarch                     84/217 
  Verifying        : guava20-20.0-8.fc29.noarch                          85/217 
  Verifying        : maven-resolver-api-1:1.3.1-1.fc30.noarch            86/217 
  Verifying        : maven-resolver-impl-1:1.3.1-1.fc30.noarch           87/217 
  Verifying        : maven-resolver-spi-1:1.3.1-1.fc30.noarch            88/217 
  Verifying        : maven-resolver-util-1:1.3.1-1.fc30.noarch           89/217 
  Verifying        : plexus-cipher-1.7-15.fc29.noarch                    90/217 
  Verifying        : plexus-containers-component-annotations-1.7.1-8.    91/217 
  Verifying        : plexus-sec-dispatcher-1.4-26.fc29.noarch            92/217 
  Verifying        : sisu-inject-1:0.3.3-6.fc29.noarch                   93/217 
  Verifying        : sisu-plexus-1:0.3.3-6.fc29.noarch                   94/217 
  Verifying        : slf4j-1.7.25-5.fc29.noarch                          95/217 
  Verifying        : copy-jdk-configs-3.7-2.fc29.noarch                  96/217 
  Verifying        : freetype-2.9.1-6.fc30.x86_64                        97/217 
  Verifying        : libjpeg-turbo-2.0.0-1.fc29.x86_64                   98/217 
  Verifying        : lksctp-tools-1.0.16-10.fc29.x86_64                  99/217 
  Verifying        : nspr-4.20.0-1.fc30.x86_64                          100/217 
  Verifying        : nss-3.41.0-1.fc30.x86_64                           101/217 
  Verifying        : nss-softokn-3.41.0-1.fc30.x86_64                   102/217 
  Verifying        : nss-util-3.41.0-1.fc30.x86_64                      103/217 
  Verifying        : tzdata-java-2018g-1.fc30.noarch                    104/217 
  Verifying        : osgi-annotation-7.0.0-1.fc30.noarch                105/217 
  Verifying        : osgi-compendium-6.0.0-6.fc29.noarch                106/217 
  Verifying        : maven-doxia-logging-api-1.7-9.fc29.noarch          107/217 
  Verifying        : maven-doxia-core-1.7-9.fc29.noarch                 108/217 
  Verifying        : maven-doxia-module-apt-1.7-9.fc29.noarch           109/217 
  Verifying        : maven-doxia-module-fml-1.7-9.fc29.noarch           110/217 
  Verifying        : maven-doxia-module-fo-1.7-9.fc29.noarch            111/217 
  Verifying        : maven-doxia-module-markdown-1.7-9.fc29.noarch      112/217 
  Verifying        : maven-doxia-module-xdoc-1.7-9.fc29.noarch          113/217 
  Verifying        : maven-doxia-module-xhtml-1.7-9.fc29.noarch         114/217 
  Verifying        : plexus-containers-container-default-1.7.1-8.fc29   115/217 
  Verifying        : plexus-i18n-1.0-0.12.b10.4.fc29.noarch             116/217 
  Verifying        : plexus-velocity-1.2-5.fc29.noarch                  117/217 
  Verifying        : velocity-1.7-24.fc29.noarch                        118/217 
  Verifying        : xalan-j2-2.7.1-38.fc29.noarch                      119/217 
  Verifying        : xml-commons-apis-1.4.01-26.fc29.noarch             120/217 
  Verifying        : geronimo-annotation-1.0-24.fc29.noarch             121/217 
  Verifying        : apache-commons-codec-1.11-4.fc29.noarch            122/217 
  Verifying        : objectweb-asm-7.0-1.fc30.noarch                    123/217 
  Verifying        : maven-shared-io-1:3.0.0-6.fc29.noarch              124/217 
  Verifying        : apache-commons-compress-1.18-1.fc30.noarch         125/217 
  Verifying        : dain-snappy-0.4-6.fc29.noarch                      126/217 
  Verifying        : xz-java-1.8-3.fc29.noarch                          127/217 
  Verifying        : bsf-2.4.0-31.fc30.noarch                           128/217 
  Verifying        : jline-2.14.6-3.fc29.noarch                         129/217 
  Verifying        : maven-artifact-manager-2.2.1-59.fc29.noarch        130/217 
  Verifying        : maven-plugin-registry-2.2.1-59.fc29.noarch         131/217 
  Verifying        : maven-profile-2.2.1-59.fc29.noarch                 132/217 
  Verifying        : maven-settings-2.2.1-59.fc29.noarch                133/217 
  Verifying        : glassfish-hk2-locator-2.4.0-11.fc30.noarch         134/217 
  Verifying        : glassfish-hk2-utils-2.4.0-11.fc30.noarch           135/217 
  Verifying        : java-1.8.0-openjdk-1:1.8.0.191.b12-12.fc30.x86_6   136/217 
  Verifying        : python3-lxml-4.2.4-1.fc30.x86_64                   137/217 
  Verifying        : python3-six-1.11.0-6.fc29.noarch                   138/217 
  Verifying        : beust-jcommander-1.71-5.fc29.noarch                139/217 
  Verifying        : apache-commons-logging-1.2-14.fc29.noarch          140/217 
  Verifying        : httpcomponents-core-4.4.10-4.fc30.noarch           141/217 
  Verifying        : publicsuffix-list-20180723-1.fc29.noarch           142/217 
  Verifying        : plexus-component-api-1.0-0.25.alpha15.fc29.noarc   143/217 
  Verifying        : maven-plugin-annotations-3.5.1-4.fc29.noarch       144/217 
  Verifying        : maven-verifier-1.6-7.fc29.noarch                   145/217 
  Verifying        : aopalliance-1.0-18.fc29.noarch                     146/217 
  Verifying        : cdi-api-1.2-9.fc29.noarch                          147/217 
  Verifying        : lua-posix-33.3.1-11.fc29.x86_64                    148/217 
  Verifying        : libpng-2:1.6.35-1.fc30.x86_64                      149/217 
  Verifying        : nss-sysinit-3.41.0-1.fc30.x86_64                   150/217 
  Verifying        : nss-softokn-freebl-3.41.0-1.fc30.x86_64            151/217 
  Verifying        : xmlunit-1.6-8.fc29.noarch                          152/217 
  Verifying        : apache-commons-configuration-1.10-12.fc29.noarch   153/217 
  Verifying        : fop-2.2-3.fc30.noarch                              154/217 
  Verifying        : log4j12-1.2.17-23.fc29.noarch                      155/217 
  Verifying        : pegdown-1.4.2-13.fc29.noarch                       156/217 
  Verifying        : xbean-4.9-1.fc29.noarch                            157/217 
  Verifying        : xerces-j2-2.12.0-1.fc30.noarch                     158/217 
  Verifying        : jansi-1.17.1-2.fc29.noarch                         159/217 
  Verifying        : glassfish-hk2-api-2.4.0-11.fc30.noarch             160/217 
  Verifying        : javassist-3.18.1-9.fc29.noarch                     161/217 
  Verifying        : alsa-lib-1.1.7-2.fc30.x86_64                       162/217 
  Verifying        : fontconfig-2.13.1-4.fc30.x86_64                    163/217 
  Verifying        : giflib-5.1.4-2.fc29.x86_64                         164/217 
  Verifying        : libX11-1.6.7-1.fc30.x86_64                         165/217 
  Verifying        : libXcomposite-0.4.4-15.fc29.x86_64                 166/217 
  Verifying        : libXext-1.3.3-10.fc29.x86_64                       167/217 
  Verifying        : libXi-1.7.9-8.fc29.x86_64                          168/217 
  Verifying        : libXrender-0.9.10-8.fc29.x86_64                    169/217 
  Verifying        : libXtst-1.2.3-8.fc29.x86_64                        170/217 
  Verifying        : xorg-x11-fonts-Type1-7.5-20.fc29.noarch            171/217 
  Verifying        : libxslt-1.1.32-3.fc29.x86_64                       172/217 
  Verifying        : glassfish-el-api-3.0.1-0.9.b08.fc29.noarch         173/217 
  Verifying        : jboss-interceptors-1.2-api-1.0.0-9.fc29.noarch     174/217 
  Verifying        : avalon-framework-4.3-21.fc29.noarch                175/217 
  Verifying        : batik-1.10-3.fc30.noarch                           176/217 
  Verifying        : fontbox-2.0.9-4.fc30.noarch                        177/217 
  Verifying        : jakarta-commons-httpclient-1:3.1-29.fc29.noarch    178/217 
  Verifying        : xmlgraphics-commons-2.2-2.fc29.noarch              179/217 
  Verifying        : parboiled-1.1.6-14.fc29.noarch                     180/217 
  Verifying        : groovy-lib-2.4.8-7.fc29.noarch                     181/217 
  Verifying        : xml-commons-resolver-1.2-26.fc29.noarch            182/217 
  Verifying        : hawtjni-runtime-1.16-3.fc29.noarch                 183/217 
  Verifying        : jansi-native-1.7-7.fc29.x86_64                     184/217 
  Verifying        : fontpackages-filesystem-1.44-22.fc29.noarch        185/217 
  Verifying        : libX11-common-1.6.7-1.fc30.noarch                  186/217 
  Verifying        : libxcb-1.13.1-1.fc30.x86_64                        187/217 
  Verifying        : ttmkfdir-3.0.9-55.fc29.x86_64                      188/217 
  Verifying        : xorg-x11-font-utils-1:7.5-40.fc29.x86_64           189/217 
  Verifying        : avalon-logkit-2.1-30.fc29.noarch                   190/217 
  Verifying        : batik-css-1.10-3.fc30.noarch                       191/217 
  Verifying        : ant-lib-1.10.5-3.fc30.noarch                       192/217 
  Verifying        : antlr-tool-2.7.7-55.fc29.noarch                    193/217 
  Verifying        : apache-ivy-2.4.0-15.fc30.noarch                    194/217 
  Verifying        : gpars-1.2.1-12.fc29.noarch                         195/217 
  Verifying        : xstream-1.4.9-8.fc29.noarch                        196/217 
  Verifying        : libXau-1.0.8-14.fc29.x86_64                        197/217 
  Verifying        : libfontenc-1.1.3-9.fc29.x86_64                     198/217 
  Verifying        : extra166y-1.7.0-10.fc29.noarch                     199/217 
  Verifying        : jcsp-1.1-0.10.rc5.fc29.noarch                      200/217 
  Verifying        : multiverse-0.7.0-9.fc29.noarch                     201/217 
  Verifying        : netty3-3.10.6-5.fc29.noarch                        202/217 
  Verifying        : xpp3-minimal-1.1.4-19.c.fc29.noarch                203/217 
  Verifying        : jzlib-1.1.3-9.fc29.noarch                          204/217 
  Verifying        : netty-tcnative-1.1.30-12.fc29.x86_64               205/217 
  Verifying        : apr-1.6.5-1.fc30.x86_64                            206/217 
  Verifying        : compat-openssl10-1:1.0.2o-3.fc29.x86_64            207/217 
  Verifying        : python3-3.7.1-4.fc30.x86_64                        208/217 
  Verifying        : procps-ng-3.3.15-4.fc29.x86_64                     209/217 
  Verifying        : cups-libs-1:2.2.8-10.fc30.x86_64                   210/217 
  Verifying        : avahi-libs-0.7-16.fc29.x86_64                      211/217 
  Verifying        : gnutls-3.6.5-1.fc30.x86_64                         212/217 
  Verifying        : dbus-libs-1:1.12.12-2.fc30.x86_64                  213/217 
  Verifying        : nettle-3.4.1rc1-1.fc30.x86_64                      214/217 
  Verifying        : lua-5.3.5-2.fc29.x86_64                            215/217 
  Verifying        : dejavu-sans-fonts-2.35-7.fc29.noarch               216/217 
  Verifying        : dejavu-fonts-common-2.35-7.fc29.noarch             217/217 

Installed:
  glassfish-hk2-maven-plugins.noarch 2.4.0-11.fc30                              
  glassfish-servlet-api.noarch 3.1.0-15.fc29                                    
  jboss-jsp-2.2-api.noarch 1.0.1-18.fc29                                        
  maven-dependency-plugin.noarch 3.1.1-1.fc30                                   
  maven-enforcer-plugin.noarch 1.4.1-9.fc29                                     
  maven-local.noarch 5.3.0-3.fc30                                               
  maven-plugin-build-helper.noarch 1.9.1-8.fc29                                 
  maven-plugin-bundle.noarch 3.5.1-1.fc30                                       
  maven-source-plugin.noarch 3.0.1-5.fc29                                       
  alsa-lib.x86_64 1.1.7-2.fc30                                                  
  ant-lib.noarch 1.10.5-3.fc30                                                  
  antlr-tool.noarch 2.7.7-55.fc29                                               
  aopalliance.noarch 1.0-18.fc29                                                
  apache-commons-cli.noarch 1.4-5.fc29                                          
  apache-commons-codec.noarch 1.11-4.fc29                                       
  apache-commons-collections.noarch 3.2.2-10.fc29                               
  apache-commons-compress.noarch 1.18-1.fc30                                    
  apache-commons-configuration.noarch 1.10-12.fc29                              
  apache-commons-io.noarch 1:2.6-4.fc29                                         
  apache-commons-lang.noarch 2.6-22.fc29                                        
  apache-commons-lang3.noarch 3.8.1-2.fc30                                      
  apache-commons-logging.noarch 1.2-14.fc29                                     
  apache-ivy.noarch 2.4.0-15.fc30                                               
  apr.x86_64 1.6.5-1.fc30                                                       
  aqute-bndlib.noarch 3.5.0-4.fc29                                              
  atinject.noarch 1-29.20100611svn86.fc29                                       
  avahi-libs.x86_64 0.7-16.fc29                                                 
  avalon-framework.noarch 4.3-21.fc29                                           
  avalon-logkit.noarch 2.1-30.fc29                                              
  batik.noarch 1.10-3.fc30                                                      
  batik-css.noarch 1.10-3.fc30                                                  
  beust-jcommander.noarch 1.71-5.fc29                                           
  bsf.noarch 2.4.0-31.fc30                                                      
  bsh.noarch 2.0-13.b6.fc29                                                     
  cdi-api.noarch 1.2-9.fc29                                                     
  compat-openssl10.x86_64 1:1.0.2o-3.fc29                                       
  copy-jdk-configs.noarch 3.7-2.fc29                                            
  cups-libs.x86_64 1:2.2.8-10.fc30                                              
  dain-snappy.noarch 0.4-6.fc29                                                 
  dbus-libs.x86_64 1:1.12.12-2.fc30                                             
  dejavu-fonts-common.noarch 2.35-7.fc29                                        
  dejavu-sans-fonts.noarch 2.35-7.fc29                                          
  extra166y.noarch 1.7.0-10.fc29                                                
  felix-bundlerepository.noarch 2.0.10-4.fc29                                   
  felix-utils.noarch 1.10.4-3.fc29                                              
  fontbox.noarch 2.0.9-4.fc30                                                   
  fontconfig.x86_64 2.13.1-4.fc30                                               
  fontpackages-filesystem.noarch 1.44-22.fc29                                   
  fop.noarch 2.2-3.fc30                                                         
  freetype.x86_64 2.9.1-6.fc30                                                  
  geronimo-annotation.noarch 1.0-24.fc29                                        
  giflib.x86_64 5.1.4-2.fc29                                                    
  glassfish-el-api.noarch 3.0.1-0.9.b08.fc29                                    
  glassfish-hk2-api.noarch 2.4.0-11.fc30                                        
  glassfish-hk2-core.noarch 2.4.0-11.fc30                                       
  glassfish-hk2-locator.noarch 2.4.0-11.fc30                                    
  glassfish-hk2-utils.noarch 2.4.0-11.fc30                                      
  gnutls.x86_64 3.6.5-1.fc30                                                    
  google-guice.noarch 4.1-13.fc30                                               
  gpars.noarch 1.2.1-12.fc29                                                    
  groovy-lib.noarch 2.4.8-7.fc29                                                
  guava20.noarch 20.0-8.fc29                                                    
  hamcrest-core.noarch 1.3-24.fc29                                              
  hawtjni-runtime.noarch 1.16-3.fc29                                            
  httpcomponents-client.noarch 4.5.6-2.fc30                                     
  httpcomponents-core.noarch 4.4.10-4.fc30                                      
  jakarta-commons-httpclient.noarch 1:3.1-29.fc29                               
  jansi.noarch 1.17.1-2.fc29                                                    
  jansi-native.x86_64 1.7-7.fc29                                                
  java-1.8.0-openjdk.x86_64 1:1.8.0.191.b12-12.fc30                             
  java-1.8.0-openjdk-devel.x86_64 1:1.8.0.191.b12-12.fc30                       
  java-1.8.0-openjdk-headless.x86_64 1:1.8.0.191.b12-12.fc30                    
  javapackages-filesystem.noarch 5.3.0-3.fc30                                   
  javapackages-local.noarch 5.3.0-3.fc30                                        
  javapackages-tools.noarch 5.3.0-3.fc30                                        
  javassist.noarch 3.18.1-9.fc29                                                
  jboss-el-2.2-api.noarch 1.0.2-9.fc29                                          
  jboss-interceptors-1.2-api.noarch 1.0.0-9.fc29                                
  jboss-servlet-3.0-api.noarch 1.0.2-10.fc29                                    
  jcsp.noarch 1.1-0.10.rc5.fc29                                                 
  jline.noarch 2.14.6-3.fc29                                                    
  junit.noarch 1:4.12-10.fc29                                                   
  jzlib.noarch 1.1.3-9.fc29                                                     
  kxml.noarch 2.3.0-17.fc29                                                     
  libX11.x86_64 1.6.7-1.fc30                                                    
  libX11-common.noarch 1.6.7-1.fc30                                             
  libXau.x86_64 1.0.8-14.fc29                                                   
  libXcomposite.x86_64 0.4.4-15.fc29                                            
  libXext.x86_64 1.3.3-10.fc29                                                  
  libXi.x86_64 1.7.9-8.fc29                                                     
  libXrender.x86_64 0.9.10-8.fc29                                               
  libXtst.x86_64 1.2.3-8.fc29                                                   
  libfontenc.x86_64 1.1.3-9.fc29                                                
  libjpeg-turbo.x86_64 2.0.0-1.fc29                                             
  libpng.x86_64 2:1.6.35-1.fc30                                                 
  libxcb.x86_64 1.13.1-1.fc30                                                   
  libxslt.x86_64 1.1.32-3.fc29                                                  
  lksctp-tools.x86_64 1.0.16-10.fc29                                            
  log4j12.noarch 1.2.17-23.fc29                                                 
  lua.x86_64 5.3.5-2.fc29                                                       
  lua-posix.x86_64 33.3.1-11.fc29                                               
  maven-archiver.noarch 3.2.0-3.fc29                                            
  maven-artifact.noarch 2.2.1-59.fc29                                           
  maven-artifact-manager.noarch 2.2.1-59.fc29                                   
  maven-artifact-transfer.noarch 1:0.9.0-5.fc29                                 
  maven-common-artifact-filters.noarch 3.0.1-5.fc29                             
  maven-compiler-plugin.noarch 3.8.0-1.fc29                                     
  maven-dependency-analyzer.noarch 1.10-1.fc30                                  
  maven-dependency-tree.noarch 3.0-6.fc29                                       
  maven-doxia-core.noarch 1.7-9.fc29                                            
  maven-doxia-logging-api.noarch 1.7-9.fc29                                     
  maven-doxia-module-apt.noarch 1.7-9.fc29                                      
  maven-doxia-module-fml.noarch 1.7-9.fc29                                      
  maven-doxia-module-fo.noarch 1.7-9.fc29                                       
  maven-doxia-module-markdown.noarch 1.7-9.fc29                                 
  maven-doxia-module-xdoc.noarch 1.7-9.fc29                                     
  maven-doxia-module-xhtml.noarch 1.7-9.fc29                                    
  maven-doxia-sink-api.noarch 1.7-9.fc29                                        
  maven-doxia-sitetools.noarch 1.7.5-3.fc29                                     
  maven-enforcer-api.noarch 1.4.1-9.fc29                                        
  maven-enforcer-rules.noarch 1.4.1-9.fc29                                      
  maven-file-management.noarch 1:3.0.0-6.fc29                                   
  maven-filtering.noarch 3.1.1-6.fc29                                           
  maven-invoker.noarch 2.2-8.fc29                                               
  maven-jar-plugin.noarch 3.1.0-2.fc29                                          
  maven-javadoc-plugin.noarch 3.0.1-2.fc29                                      
  maven-lib.noarch 1:3.5.4-7.fc30                                               
  maven-model.noarch 2.2.1-59.fc29                                              
  maven-osgi.noarch 1:0.2.0-16.fc29                                             
  maven-plugin-annotations.noarch 3.5.1-4.fc29                                  
  maven-plugin-registry.noarch 2.2.1-59.fc29                                    
  maven-plugin-testing-harness.noarch 3.3.0-13.fc29                             
  maven-profile.noarch 2.2.1-59.fc29                                            
  maven-project.noarch 2.2.1-59.fc29                                            
  maven-reporting-api.noarch 1:3.0-15.fc29                                      
  maven-reporting-impl.noarch 3.0.0-4.fc29                                      
  maven-resolver-api.noarch 1:1.3.1-1.fc30                                      
  maven-resolver-impl.noarch 1:1.3.1-1.fc30                                     
  maven-resolver-spi.noarch 1:1.3.1-1.fc30                                      
  maven-resolver-util.noarch 1:1.3.1-1.fc30                                     
  maven-resources-plugin.noarch 3.1.0-3.fc29                                    
  maven-settings.noarch 2.2.1-59.fc29                                           
  maven-shared-incremental.noarch 1.1-15.fc29                                   
  maven-shared-io.noarch 1:3.0.0-6.fc29                                         
  maven-shared-utils.noarch 3.2.1-0.2.fc29                                      
  maven-surefire.noarch 2.22.0-3.fc29                                           
  maven-surefire-plugin.noarch 2.22.0-3.fc29                                    
  maven-surefire-provider-junit.noarch 2.22.0-3.fc29                            
  maven-surefire-provider-testng.noarch 2.22.0-3.fc29                           
  maven-verifier.noarch 1.6-7.fc29                                              
  maven-wagon-provider-api.noarch 3.2.0-1.fc30                                  
  multiverse.noarch 0.7.0-9.fc29                                                
  nettle.x86_64 3.4.1rc1-1.fc30                                                 
  netty-tcnative.x86_64 1.1.30-12.fc29                                          
  netty3.noarch 3.10.6-5.fc29                                                   
  nspr.x86_64 4.20.0-1.fc30                                                     
  nss.x86_64 3.41.0-1.fc30                                                      
  nss-softokn.x86_64 3.41.0-1.fc30                                              
  nss-softokn-freebl.x86_64 3.41.0-1.fc30                                       
  nss-sysinit.x86_64 3.41.0-1.fc30                                              
  nss-util.x86_64 3.41.0-1.fc30                                                 
  objectweb-asm.noarch 7.0-1.fc30                                               
  osgi-annotation.noarch 7.0.0-1.fc30                                           
  osgi-compendium.noarch 6.0.0-6.fc29                                           
  osgi-core.noarch 6.0.0-7.fc29                                                 
  parboiled.noarch 1.1.6-14.fc29                                                
  pegdown.noarch 1.4.2-13.fc29                                                  
  plexus-archiver.noarch 3.6.0-2.fc29                                           
  plexus-build-api.noarch 0.0.7-21.fc29                                         
  plexus-cipher.noarch 1.7-15.fc29                                              
  plexus-classworlds.noarch 2.5.2-10.fc29                                       
  plexus-compiler.noarch 2.8.2-3.fc29                                           
  plexus-component-api.noarch 1.0-0.25.alpha15.fc29                             
  plexus-containers-component-annotations.noarch 1.7.1-8.fc29                   
  plexus-containers-container-default.noarch 1.7.1-8.fc29                       
  plexus-i18n.noarch 1.0-0.12.b10.4.fc29                                        
  plexus-interactivity-api.noarch 1.0-0.27.alpha6.fc29                          
  plexus-interpolation.noarch 1.22-10.fc29                                      
  plexus-io.noarch 3.0.0-3.fc29                                                 
  plexus-languages.noarch 0.9.10-3.fc29                                         
  plexus-sec-dispatcher.noarch 1.4-26.fc29                                      
  plexus-utils.noarch 3.1.0-3.fc29                                              
  plexus-velocity.noarch 1.2-5.fc29                                             
  procps-ng.x86_64 3.3.15-4.fc29                                                
  publicsuffix-list.noarch 20180723-1.fc29                                      
  python3.x86_64 3.7.1-4.fc30                                                   
  python3-javapackages.noarch 5.3.0-3.fc30                                      
  python3-lxml.x86_64 4.2.4-1.fc30                                              
  python3-six.noarch 1.11.0-6.fc29                                              
  qdox.noarch 2.0-3.M9.fc29                                                     
  sisu-inject.noarch 1:0.3.3-6.fc29                                             
  sisu-plexus.noarch 1:0.3.3-6.fc29                                             
  slf4j.noarch 1.7.25-5.fc29                                                    
  ttmkfdir.x86_64 3.0.9-55.fc29                                                 
  tzdata-java.noarch 2018g-1.fc30                                               
  velocity.noarch 1.7-24.fc29                                                   
  xalan-j2.noarch 2.7.1-38.fc29                                                 
  xbean.noarch 4.9-1.fc29                                                       
  xerces-j2.noarch 2.12.0-1.fc30                                                
  xml-commons-apis.noarch 1.4.01-26.fc29                                        
  xml-commons-resolver.noarch 1.2-26.fc29                                       
  xmlgraphics-commons.noarch 2.2-2.fc29                                         
  xmlunit.noarch 1.6-8.fc29                                                     
  xmvn-api.noarch 3.0.0-22.fc30                                                 
  xmvn-connector-aether.noarch 3.0.0-22.fc30                                    
  xmvn-core.noarch 3.0.0-22.fc30                                                
  xmvn-install.noarch 3.0.0-22.fc30                                             
  xmvn-minimal.noarch 3.0.0-22.fc30                                             
  xmvn-mojo.noarch 3.0.0-22.fc30                                                
  xmvn-resolve.noarch 3.0.0-22.fc30                                             
  xmvn-subst.noarch 3.0.0-22.fc30                                               
  xorg-x11-font-utils.x86_64 1:7.5-40.fc29                                      
  xorg-x11-fonts-Type1.noarch 7.5-20.fc29                                       
  xpp3.noarch 1.1.4-19.c.fc29                                                   
  xpp3-minimal.noarch 1.1.4-19.c.fc29                                           
  xstream.noarch 1.4.9-8.fc29                                                   
  xz-java.noarch 1.8-3.fc29                                                     

Complete!
Finish: build setup for javamail-1.6.3-3.fc30.src.rpm
Start: rpmbuild javamail-1.6.3-3.fc30.src.rpm
Building target platforms: x86_64
Building for target x86_64
Executing(%prep): /bin/sh -e /var/tmp/rpm-tmp.pXMPsd
+ umask 022
+ cd /builddir/build/BUILD
+ cd /builddir/build/BUILD
+ rm -rf javamail-1.6.3
+ /usr/bin/gzip -dc /builddir/build/SOURCES/1.6.3.tar.gz
+ /usr/bin/tar -xof -
+ STATUS=0
+ '[' 0 -ne 0 ']'
+ cd javamail-1.6.3
+ /usr/bin/chmod -Rf a+rX,u+w,g-w,o-w .
+ /usr/bin/python3 /usr/share/java-utils/pom_editor.py pom_remove_parent
+ /usr/bin/python3 /usr/share/java-utils/pom_editor.py pom_disable_module android
+ /usr/bin/python3 /usr/share/java-utils/pom_editor.py pom_disable_module javadoc
+ /usr/bin/python3 /usr/share/java-utils/pom_editor.py pom_remove_dep com.sun.activation:jakarta.activation mail
+ /usr/bin/python3 /usr/share/java-utils/pom_editor.py pom_xpath_remove /pom:project/pom:profiles
+ /usr/bin/python3 /usr/share/java-utils/pom_editor.py pom_remove_plugin :maven-javadoc-plugin
+ /usr/bin/python3 /usr/share/java-utils/pom_editor.py pom_xpath_set pom:packaging jar webapp/pom.xml
+ /usr/bin/python3 /usr/share/java-utils/pom_editor.py pom_xpath_inject pom:modules '<module>servlet</module>'
+ /usr/bin/python3 /usr/share/java-utils/mvn_alias.py com.sun.mail:jakarta.mail com.sun.mail:javax.mail
+ /usr/bin/python3 /usr/share/java-utils/mvn_alias.py jakarta.mail:jakarta.mail-api javax.mail:javax.mail-api
+ /usr/bin/python3 /usr/share/java-utils/mvn_alias.py com.sun.mail:mailapi javax.mail:mailapi
+ /usr/bin/python3 /usr/share/java-utils/mvn_alias.py com.sun.mail:javax.mail javax.mail:mail org.eclipse.jetty.orbit:javax.mail.glassfish
+ /usr/bin/python3 /usr/share/java-utils/mvn_file.py 'com.sun.mail:{javax.mail}' javamail/@1 javamail/mail
+ exit 0
Executing(%build): /bin/sh -e /var/tmp/rpm-tmp.T6az60
+ umask 022
+ cd /builddir/build/BUILD
+ cd javamail-1.6.3
+ /usr/bin/python3 /usr/share/java-utils/mvn_build.py -j -- -Dmaven.test.failure.ignore=true -P deploy-snapshot
Executing: xmvn --batch-mode --offline -Dmaven.test.failure.ignore=true -P deploy-snapshot verify org.fedoraproject.xmvn:xmvn-mojo:install org.fedoraproject.xmvn:xmvn-mojo:builddep
['xmvn', '--batch-mode', '--offline', '-Dmaven.test.failure.ignore=true', '-P', 'deploy-snapshot', 'verify', 'org.fedoraproject.xmvn:xmvn-mojo:install', 'org.fedoraproject.xmvn:xmvn-mojo:builddep']
[INFO] Scanning for projects...
[INFO] ------------------------------------------------------------------------
[INFO] Reactor Build Order:
[INFO] 
[INFO] JavaMail API distribution                                          [pom]
[INFO] JavaMail API                                                       [jar]
[INFO] JavaMail API demo servlet                                          [jar]
[INFO] JavaMail API (no providers)                                        [jar]
[INFO] JavaMail API jar                                                   [jar]
[INFO] JavaMail API smtp provider                                         [jar]
[INFO] JavaMail API imap provider                                         [jar]
[INFO] JavaMail API Gmail IMAP provider                                   [jar]
[INFO] JavaMail API pop3 provider                                         [jar]
[INFO] JavaMail API dsn support                                           [jar]
[INFO] JavaMail API logging handler                                       [jar]
[INFO] 
[INFO] --------------------------< com.sun.mail:all >--------------------------
[INFO] Building JavaMail API distribution 1.6.3                          [1/11]
[INFO] --------------------------------[ pom ]---------------------------------
[INFO] 
[INFO] --- maven-enforcer-plugin:1.4.1:enforce (enforce-version) @ all ---
[INFO] 
[INFO] --- osgiversion-maven-plugin:2.4.0:compute-osgi-version (compute-osgi-version) @ all ---
[INFO] 
[INFO] --- build-helper-maven-plugin:1.9.1:add-source (add-source) @ all ---
[INFO] Source directory: /builddir/build/BUILD/javamail-1.6.3/target/sources added.
[INFO] Source directory: /builddir/build/BUILD/javamail-1.6.3/target/classes added.
[INFO] 
[INFO] --- maven-bundle-plugin:3.5.1:manifest (osgi-manifest) @ all ---
[WARNING] Ignoring project type pom - supportedProjectTypes = [jar, bundle]
[INFO] 
[INFO] --- maven-source-plugin:3.0.1:jar-no-fork (attach-sources) @ all ---
[INFO] 
[INFO] ---------------------< com.sun.mail:jakarta.mail >----------------------
[INFO] Building JavaMail API 1.6.3                                       [2/11]
[INFO] --------------------------------[ jar ]---------------------------------
[INFO] 
[INFO] --- maven-enforcer-plugin:1.4.1:enforce (enforce-version) @ jakarta.mail ---
[INFO] 
[INFO] --- osgiversion-maven-plugin:2.4.0:compute-osgi-version (compute-osgi-version) @ jakarta.mail ---
[INFO] 
[INFO] --- build-helper-maven-plugin:1.9.1:add-source (add-source) @ jakarta.mail ---
[INFO] Source directory: /builddir/build/BUILD/javamail-1.6.3/mail/target/sources added.
[INFO] Source directory: /builddir/build/BUILD/javamail-1.6.3/mail/target/classes added.
[INFO] 
[INFO] --- maven-resources-plugin:3.1.0:resources (default-resources) @ jakarta.mail ---
[INFO] Using 'iso-8859-1' encoding to copy filtered resources.
[INFO] Copying 10 resources
[INFO] 
[INFO] --- maven-compiler-plugin:3.8.0:compile (default-compile) @ jakarta.mail ---
[INFO] Compiling 239 source files to /builddir/build/BUILD/javamail-1.6.3/mail/target/classes
[INFO] 
[INFO] --- maven-bundle-plugin:3.5.1:manifest (osgi-manifest) @ jakarta.mail ---
[INFO] 
[INFO] --- maven-resources-plugin:3.1.0:testResources (default-testResources) @ jakarta.mail ---
[INFO] Using 'iso-8859-1' encoding to copy filtered resources.
[INFO] Copying 10 resources
[INFO] 
[INFO] --- maven-compiler-plugin:3.8.0:testCompile (default-testCompile) @ jakarta.mail ---
[INFO] Changes detected - recompiling the module!
[INFO] Compiling 120 source files to /builddir/build/BUILD/javamail-1.6.3/mail/target/test-classes
[INFO] 
[INFO] --- maven-surefire-plugin:2.22.0:test (default-test) @ jakarta.mail ---
[INFO] 
[INFO] -------------------------------------------------------
[INFO]  T E S T S
[INFO] -------------------------------------------------------
[INFO] Running com.sun.mail.handlers.TextXmlTest
[INFO] Tests run: 5, Failures: 0, Errors: 0, Skipped: 0, Time elapsed: 0.132 s - in com.sun.mail.handlers.TextXmlTest
[INFO] Running com.sun.mail.iap.ResponseInputStreamTest
[INFO] Tests run: 1, Failures: 0, Errors: 0, Skipped: 0, Time elapsed: 0.001 s - in com.sun.mail.iap.ResponseInputStreamTest
[INFO] Running com.sun.mail.iap.ProtocolTest
[INFO] Tests run: 2, Failures: 0, Errors: 0, Skipped: 0, Time elapsed: 0.459 s - in com.sun.mail.iap.ProtocolTest
[INFO] Running com.sun.mail.iap.ResponseTest
[INFO] Tests run: 13, Failures: 0, Errors: 0, Skipped: 0, Time elapsed: 0.028 s - in com.sun.mail.iap.ResponseTest
[INFO] Running com.sun.mail.smtp.SMTPCloseTest
[INFO] Tests run: 1, Failures: 0, Errors: 0, Skipped: 0, Time elapsed: 1.138 s - in com.sun.mail.smtp.SMTPCloseTest
[INFO] Running com.sun.mail.smtp.SMTPBdatTest
[INFO] Tests run: 2, Failures: 0, Errors: 0, Skipped: 0, Time elapsed: 0.289 s - in com.sun.mail.smtp.SMTPBdatTest
[INFO] Running com.sun.mail.smtp.SMTPWriteTimeoutTest
[INFO] Tests run: 1, Failures: 0, Errors: 0, Skipped: 0, Time elapsed: 1.836 s - in com.sun.mail.smtp.SMTPWriteTimeoutTest
[INFO] Running com.sun.mail.smtp.SMTPUtf8Test
[INFO] Tests run: 4, Failures: 0, Errors: 0, Skipped: 0, Time elapsed: 0.193 s - in com.sun.mail.smtp.SMTPUtf8Test
[INFO] Running com.sun.mail.smtp.SMTPAuthDebugTest
[INFO] Tests run: 3, Failures: 0, Errors: 0, Skipped: 0, Time elapsed: 3.148 s - in com.sun.mail.smtp.SMTPAuthDebugTest
[INFO] Running com.sun.mail.smtp.SMTPIOExceptionTest
[INFO] Tests run: 1, Failures: 0, Errors: 0, Skipped: 0, Time elapsed: 0.251 s - in com.sun.mail.smtp.SMTPIOExceptionTest
[INFO] Running com.sun.mail.smtp.SMTPSaslLoginTest
[INFO] Tests run: 6, Failures: 0, Errors: 0, Skipped: 0, Time elapsed: 0.369 s - in com.sun.mail.smtp.SMTPSaslLoginTest
[INFO] Running com.sun.mail.smtp.SMTPConnectFailureTest
[INFO] Tests run: 1, Failures: 0, Errors: 0, Skipped: 0, Time elapsed: 0 s - in com.sun.mail.smtp.SMTPConnectFailureTest
[INFO] Running com.sun.mail.pop3.POP3MessageTest
[INFO] Tests run: 2, Failures: 0, Errors: 0, Skipped: 0, Time elapsed: 2.361 s - in com.sun.mail.pop3.POP3MessageTest
[INFO] Running com.sun.mail.pop3.POP3ReadableMimeTest
[INFO] Tests run: 2, Failures: 0, Errors: 0, Skipped: 0, Time elapsed: 2.339 s - in com.sun.mail.pop3.POP3ReadableMimeTest
[INFO] Running com.sun.mail.pop3.POP3StoreTest
[INFO] Tests run: 2, Failures: 0, Errors: 0, Skipped: 0, Time elapsed: 0.019 s - in com.sun.mail.pop3.POP3StoreTest
[INFO] Running com.sun.mail.pop3.POP3FolderClosedExceptionTest
[INFO] Tests run: 2, Failures: 0, Errors: 0, Skipped: 0, Time elapsed: 2.046 s - in com.sun.mail.pop3.POP3FolderClosedExceptionTest
[INFO] Running com.sun.mail.pop3.POP3AuthDebugTest
[INFO] Tests run: 3, Failures: 0, Errors: 0, Skipped: 0, Time elapsed: 3.021 s - in com.sun.mail.pop3.POP3AuthDebugTest
[INFO] Running com.sun.mail.imap.IMAPMessageNumberOutOfRangeTest
[INFO] Tests run: 1, Failures: 0, Errors: 0, Skipped: 0, Time elapsed: 0.152 s - in com.sun.mail.imap.IMAPMessageNumberOutOfRangeTest
[INFO] Running com.sun.mail.imap.IMAPLoginFailureTest
[INFO] Tests run: 1, Failures: 0, Errors: 0, Skipped: 0, Time elapsed: 0.002 s - in com.sun.mail.imap.IMAPLoginFailureTest
[INFO] Running com.sun.mail.imap.IMAPSaslLoginTest
[INFO] Tests run: 1, Failures: 0, Errors: 0, Skipped: 0, Time elapsed: 0.01 s - in com.sun.mail.imap.IMAPSaslLoginTest
[INFO] Running com.sun.mail.imap.IMAPIdleManagerTest
Dec 19, 2018 9:59:50 PM com.sun.mail.imap.IMAPHandler readLine
SEVERE: Current line is null!
[INFO] Tests run: 10, Failures: 0, Errors: 0, Skipped: 0, Time elapsed: 3.533 s - in com.sun.mail.imap.IMAPIdleManagerTest
[INFO] Running com.sun.mail.imap.IMAPMessageTest
[INFO] Tests run: 8, Failures: 0, Errors: 0, Skipped: 0, Time elapsed: 0.838 s - in com.sun.mail.imap.IMAPMessageTest
[INFO] Running com.sun.mail.imap.IMAPLoginCapabilitiesTest
[INFO] Tests run: 3, Failures: 0, Errors: 0, Skipped: 0, Time elapsed: 0.132 s - in com.sun.mail.imap.IMAPLoginCapabilitiesTest
[INFO] Running com.sun.mail.imap.IMAPAlertTest
[INFO] Tests run: 1, Failures: 0, Errors: 0, Skipped: 0, Time elapsed: 0.04 s - in com.sun.mail.imap.IMAPAlertTest
[INFO] Running com.sun.mail.imap.IMAPConnectFailureTest
[INFO] Tests run: 2, Failures: 0, Errors: 0, Skipped: 0, Time elapsed: 0.007 s - in com.sun.mail.imap.IMAPConnectFailureTest
[INFO] Running com.sun.mail.imap.IMAPResponseEventTest
[INFO] Tests run: 3, Failures: 0, Errors: 0, Skipped: 0, Time elapsed: 0.017 s - in com.sun.mail.imap.IMAPResponseEventTest
[INFO] Running com.sun.mail.imap.IMAPIDTest
[INFO] Tests run: 1, Failures: 0, Errors: 0, Skipped: 0, Time elapsed: 0.062 s - in com.sun.mail.imap.IMAPIDTest
[INFO] Running com.sun.mail.imap.IMAPLoginReferralTest
[INFO] Tests run: 5, Failures: 0, Errors: 0, Skipped: 0, Time elapsed: 0.063 s - in com.sun.mail.imap.IMAPLoginReferralTest
[INFO] Running com.sun.mail.imap.IMAPStoreTest
[INFO] Tests run: 9, Failures: 0, Errors: 0, Skipped: 0, Time elapsed: 0.669 s - in com.sun.mail.imap.IMAPStoreTest
[INFO] Running com.sun.mail.imap.IMAPFolderTest
[INFO] Tests run: 13, Failures: 0, Errors: 0, Skipped: 0, Time elapsed: 0.382 s - in com.sun.mail.imap.IMAPFolderTest
[INFO] Running com.sun.mail.imap.IMAPUidExpungeTest
[INFO] Tests run: 12, Failures: 0, Errors: 0, Skipped: 0, Time elapsed: 1.535 s - in com.sun.mail.imap.IMAPUidExpungeTest
[INFO] Running com.sun.mail.imap.MessageCacheTest
[INFO] Tests run: 2, Failures: 0, Errors: 0, Skipped: 0, Time elapsed: 0 s - in com.sun.mail.imap.MessageCacheTest
[INFO] Running com.sun.mail.imap.IMAPSearchTest
[INFO] Tests run: 2, Failures: 0, Errors: 0, Skipped: 0, Time elapsed: 0.095 s - in com.sun.mail.imap.IMAPSearchTest
[INFO] Running com.sun.mail.imap.IMAPIdleUntaggedResponseTest
[INFO] Tests run: 1, Failures: 0, Errors: 0, Skipped: 0, Time elapsed: 0.09 s - in com.sun.mail.imap.IMAPIdleUntaggedResponseTest
[INFO] Running com.sun.mail.imap.IMAPIdleStateTest
[INFO] Tests run: 1, Failures: 0, Errors: 0, Skipped: 0, Time elapsed: 0.008 s - in com.sun.mail.imap.IMAPIdleStateTest
[INFO] Running com.sun.mail.imap.IMAPCloseFailureTest
[INFO] Tests run: 2, Failures: 0, Errors: 0, Skipped: 0, Time elapsed: 0.261 s - in com.sun.mail.imap.IMAPCloseFailureTest
[INFO] Running com.sun.mail.imap.IMAPFetchProfileTest
[INFO] Tests run: 3, Failures: 0, Errors: 0, Skipped: 0, Time elapsed: 0.39 s - in com.sun.mail.imap.IMAPFetchProfileTest
[INFO] Running com.sun.mail.imap.IMAPAuthDebugTest
[INFO] Tests run: 3, Failures: 0, Errors: 0, Skipped: 0, Time elapsed: 0.014 s - in com.sun.mail.imap.IMAPAuthDebugTest
[INFO] Running com.sun.mail.imap.protocol.UIDSetTest
[INFO] Tests run: 13, Failures: 0, Errors: 0, Skipped: 0, Time elapsed: 0.012 s - in com.sun.mail.imap.protocol.UIDSetTest
[INFO] Running com.sun.mail.imap.protocol.MODSEQTest
[INFO] Tests run: 2, Failures: 0, Errors: 0, Skipped: 0, Time elapsed: 0.004 s - in com.sun.mail.imap.protocol.MODSEQTest
[INFO] Running com.sun.mail.imap.protocol.IMAPProtocolTest
[INFO] Tests run: 2, Failures: 0, Errors: 0, Skipped: 0, Time elapsed: 0.006 s - in com.sun.mail.imap.protocol.IMAPProtocolTest
[INFO] Running com.sun.mail.imap.protocol.StatusTest
[INFO] Tests run: 5, Failures: 0, Errors: 0, Skipped: 0, Time elapsed: 0.006 s - in com.sun.mail.imap.protocol.StatusTest
[INFO] Running com.sun.mail.imap.protocol.StratoImapBugfixTest
[INFO] Tests run: 4, Failures: 0, Errors: 0, Skipped: 0, Time elapsed: 0.006 s - in com.sun.mail.imap.protocol.StratoImapBugfixTest
[INFO] Running com.sun.mail.imap.protocol.NamespacesTest
[INFO] Tests run: 4, Failures: 0, Errors: 0, Skipped: 0, Time elapsed: 0.006 s - in com.sun.mail.imap.protocol.NamespacesTest
[INFO] Running com.sun.mail.imap.protocol.BODYSTRUCTURETest
[INFO] Tests run: 2, Failures: 0, Errors: 0, Skipped: 0, Time elapsed: 0.007 s - in com.sun.mail.imap.protocol.BODYSTRUCTURETest
[INFO] Running com.sun.mail.imap.protocol.EnvelopeTest
[INFO] Tests run: 2, Failures: 0, Errors: 0, Skipped: 0, Time elapsed: 0.006 s - in com.sun.mail.imap.protocol.EnvelopeTest
[INFO] Running com.sun.mail.util.SocketFetcherTest
[INFO] Tests run: 6, Failures: 0, Errors: 0, Skipped: 0, Time elapsed: 0.005 s - in com.sun.mail.util.SocketFetcherTest
[INFO] Running com.sun.mail.util.LineInputStreamTest
[INFO] Tests run: 3, Failures: 0, Errors: 0, Skipped: 0, Time elapsed: 0.005 s - in com.sun.mail.util.LineInputStreamTest
[INFO] Running com.sun.mail.util.UUDecoderStreamTest
[INFO] Tests run: 17, Failures: 0, Errors: 0, Skipped: 0, Time elapsed: 0.006 s - in com.sun.mail.util.UUDecoderStreamTest
[INFO] Running com.sun.mail.util.MimeUtilTestSuite
ContentTypeCleaner
[INFO] Tests run: 3, Failures: 0, Errors: 0, Skipped: 0, Time elapsed: 0.076 s - in com.sun.mail.util.MimeUtilTestSuite
[INFO] Running com.sun.mail.util.PropUtilTest
[INFO] Tests run: 19, Failures: 0, Errors: 0, Skipped: 0, Time elapsed: 0.003 s - in com.sun.mail.util.PropUtilTest
[INFO] Running com.sun.mail.util.WriteTimeoutSocketTest
javax.mail.MessagingException: No appropriate protocol (protocol is disabled or cipher suites are inappropriate);
  nested exception is:
	javax.net.ssl.SSLHandshakeException: No appropriate protocol (protocol is disabled or cipher suites are inappropriate)
javax.mail.MessagingException: No appropriate protocol (protocol is disabled or cipher suites are inappropriate);
  nested exception is:
	javax.net.ssl.SSLHandshakeException: No appropriate protocol (protocol is disabled or cipher suites are inappropriate)
[ERROR] Tests run: 5, Failures: 2, Errors: 0, Skipped: 0, Time elapsed: 1.78 s <<< FAILURE! - in com.sun.mail.util.WriteTimeoutSocketTest
[ERROR] testSSL(com.sun.mail.util.WriteTimeoutSocketTest)  Time elapsed: 0.487 s  <<< FAILURE!
java.lang.AssertionError: 
javax.mail.MessagingException: No appropriate protocol (protocol is disabled or cipher suites are inappropriate);
  nested exception is:
	javax.net.ssl.SSLHandshakeException: No appropriate protocol (protocol is disabled or cipher suites are inappropriate)
	at com.sun.mail.util.WriteTimeoutSocketTest.test(WriteTimeoutSocketTest.java:225)
	at com.sun.mail.util.WriteTimeoutSocketTest.testSSL(WriteTimeoutSocketTest.java:99)

[ERROR] testSSLSocketFactory(com.sun.mail.util.WriteTimeoutSocketTest)  Time elapsed: 0.068 s  <<< FAILURE!
java.lang.AssertionError: 
javax.mail.MessagingException: No appropriate protocol (protocol is disabled or cipher suites are inappropriate);
  nested exception is:
	javax.net.ssl.SSLHandshakeException: No appropriate protocol (protocol is disabled or cipher suites are inappropriate)
	at com.sun.mail.util.WriteTimeoutSocketTest.test(WriteTimeoutSocketTest.java:225)
	at com.sun.mail.util.WriteTimeoutSocketTest.testSSLSocketFactory(WriteTimeoutSocketTest.java:120)

[INFO] Running com.sun.mail.util.QPEncoderStreamTest
[INFO] Tests run: 1, Failures: 0, Errors: 0, Skipped: 0, Time elapsed: 0.001 s - in com.sun.mail.util.QPEncoderStreamTest
[INFO] Running com.sun.mail.util.BASE64Test
[INFO] Tests run: 2, Failures: 0, Errors: 0, Skipped: 0, Time elapsed: 0.795 s - in com.sun.mail.util.BASE64Test
[INFO] Running com.sun.mail.util.logging.DurationFilterTest
[INFO] Tests run: 58, Failures: 0, Errors: 0, Skipped: 0, Time elapsed: 4.209 s - in com.sun.mail.util.logging.DurationFilterTest
[INFO] Running com.sun.mail.util.logging.SeverityComparatorTest
[INFO] Tests run: 65, Failures: 0, Errors: 0, Skipped: 0, Time elapsed: 0.357 s - in com.sun.mail.util.logging.SeverityComparatorTest
[INFO] Running com.sun.mail.util.logging.LogManagerPropertiesTest
[INFO] Tests run: 45, Failures: 0, Errors: 0, Skipped: 0, Time elapsed: 0.086 s - in com.sun.mail.util.logging.LogManagerPropertiesTest
[INFO] Running com.sun.mail.util.logging.CollectorFormatterTest
[INFO] Tests run: 58, Failures: 0, Errors: 0, Skipped: 0, Time elapsed: 1.004 s - in com.sun.mail.util.logging.CollectorFormatterTest
[INFO] Running com.sun.mail.util.logging.MailHandlerTest
[INFO] Tests run: 131, Failures: 0, Errors: 0, Skipped: 0, Time elapsed: 6.507 s - in com.sun.mail.util.logging.MailHandlerTest
[INFO] Running com.sun.mail.util.logging.CompactFormatterTest
[INFO] Tests run: 119, Failures: 0, Errors: 0, Skipped: 0, Time elapsed: 0.463 s - in com.sun.mail.util.logging.CompactFormatterTest
[INFO] Running javax.mail.search.SearchTermSerializationTest
[INFO] Tests run: 1, Failures: 0, Errors: 0, Skipped: 0, Time elapsed: 0.023 s - in javax.mail.search.SearchTermSerializationTest
[INFO] Running javax.mail.URLNameTest
[INFO] Tests run: 3, Failures: 0, Errors: 0, Skipped: 0, Time elapsed: 0 s - in javax.mail.URLNameTest
[INFO] Running javax.mail.internet.ContentTypeTest
[INFO] Tests run: 1, Failures: 0, Errors: 0, Skipped: 0, Time elapsed: 0.005 s - in javax.mail.internet.ContentTypeTest
[INFO] Running javax.mail.internet.HeaderTokenizerTest
[INFO] Tests run: 56, Failures: 0, Errors: 0, Skipped: 0, Time elapsed: 0.006 s - in javax.mail.internet.HeaderTokenizerTest
[INFO] Running javax.mail.internet.ModifyMessageTest
[INFO] Tests run: 5, Failures: 0, Errors: 0, Skipped: 0, Time elapsed: 0.005 s - in javax.mail.internet.ModifyMessageTest
[INFO] Running javax.mail.internet.AddFromTest
[INFO] Tests run: 2, Failures: 0, Errors: 0, Skipped: 0, Time elapsed: 0.005 s - in javax.mail.internet.AddFromTest
[INFO] Running javax.mail.internet.ReferencesTest
[INFO] Tests run: 8, Failures: 0, Errors: 0, Skipped: 0, Time elapsed: 0.004 s - in javax.mail.internet.ReferencesTest
[INFO] Running javax.mail.internet.MailDateFormatTest
[INFO] Tests run: 45, Failures: 0, Errors: 0, Skipped: 0, Time elapsed: 0.069 s - in javax.mail.internet.MailDateFormatTest
[INFO] Running javax.mail.internet.AddAddressHeaderTest
[INFO] Tests run: 4, Failures: 0, Errors: 0, Skipped: 0, Time elapsed: 0.003 s - in javax.mail.internet.AddAddressHeaderTest
[INFO] Running javax.mail.internet.InternetAddressExtraTest
[INFO] Tests run: 3, Failures: 0, Errors: 0, Skipped: 0, Time elapsed: 0.007 s - in javax.mail.internet.InternetAddressExtraTest
[INFO] Running javax.mail.internet.MimeMultipartPreambleTest
[INFO] Tests run: 3, Failures: 0, Errors: 0, Skipped: 0, Time elapsed: 0.008 s - in javax.mail.internet.MimeMultipartPreambleTest
[INFO] Running javax.mail.internet.InternetHeadersTest
[INFO] Tests run: 5, Failures: 0, Errors: 0, Skipped: 0, Time elapsed: 0.006 s - in javax.mail.internet.InternetHeadersTest
[INFO] Running javax.mail.internet.MimeBodyPartTest
[INFO] Tests run: 6, Failures: 0, Errors: 0, Skipped: 0, Time elapsed: 0.006 s - in javax.mail.internet.MimeBodyPartTest
[INFO] Running javax.mail.internet.MimeUtilityTest
[INFO] Tests run: 5, Failures: 0, Errors: 0, Skipped: 0, Time elapsed: 0.02 s - in javax.mail.internet.MimeUtilityTest
[INFO] Running javax.mail.internet.ParameterListTestSuite
ParameterListTests
WindowsFileNames
AppleFileNames
NonAsciiFileNames
DecodeParameters
ParametersNoStrict
[INFO] Tests run: 9, Failures: 0, Errors: 0, Skipped: 0, Time elapsed: 0.135 s - in javax.mail.internet.ParameterListTestSuite
[INFO] Running javax.mail.internet.MimeMessageTest
[INFO] Tests run: 10, Failures: 0, Errors: 0, Skipped: 0, Time elapsed: 0.001 s - in javax.mail.internet.MimeMessageTest
[INFO] Running javax.mail.internet.NewsAddressTest
[INFO] Tests run: 1, Failures: 0, Errors: 0, Skipped: 0, Time elapsed: 0.003 s - in javax.mail.internet.NewsAddressTest
[INFO] Running javax.mail.internet.RestrictEncodingTest
[INFO] Tests run: 3, Failures: 0, Errors: 0, Skipped: 0, Time elapsed: 0 s - in javax.mail.internet.RestrictEncodingTest
[INFO] Running javax.mail.internet.ContentDispositionTestSuite
[INFO] Tests run: 3, Failures: 0, Errors: 0, Skipped: 0, Time elapsed: 0.016 s - in javax.mail.internet.ContentDispositionTestSuite
[INFO] Running javax.mail.internet.MimeMultipartPropertyTest
[INFO] Tests run: 10, Failures: 0, Errors: 0, Skipped: 0, Time elapsed: 0.006 s - in javax.mail.internet.MimeMultipartPropertyTest
[INFO] Running javax.mail.internet.MimeMessageTestSuite
AllowEncodedMessages
[INFO] Tests run: 1, Failures: 0, Errors: 0, Skipped: 0, Time elapsed: 0.014 s - in javax.mail.internet.MimeMessageTestSuite
[INFO] Running javax.mail.internet.GetLocalAddressTest
[INFO] Tests run: 7, Failures: 0, Errors: 0, Skipped: 0, Time elapsed: 0.005 s - in javax.mail.internet.GetLocalAddressTest
[INFO] Running javax.mail.internet.NonAsciiBoundaryTest
[INFO] Tests run: 1, Failures: 0, Errors: 0, Skipped: 0, Time elapsed: 0.005 s - in javax.mail.internet.NonAsciiBoundaryTest
[INFO] Running javax.mail.internet.InternetAddressFoldTest
[INFO] Tests run: 9, Failures: 0, Errors: 0, Skipped: 0, Time elapsed: 0 s - in javax.mail.internet.InternetAddressFoldTest
[INFO] Running javax.mail.internet.FoldTest
[INFO] Tests run: 48, Failures: 0, Errors: 0, Skipped: 0, Time elapsed: 0.005 s - in javax.mail.internet.FoldTest
[INFO] Running javax.mail.internet.MimeBodyPartTestSuite
NoEncodeFileName
EncodeFileName
EncodeFileNameNoEncodeParameters
[INFO] Tests run: 3, Failures: 0, Errors: 0, Skipped: 0, Time elapsed: 0.12 s - in javax.mail.internet.MimeBodyPartTestSuite
[INFO] Running javax.mail.internet.InternetAddressTest
[INFO] Tests run: 188, Failures: 0, Errors: 0, Skipped: 0, Time elapsed: 0.084 s - in javax.mail.internet.InternetAddressTest
[INFO] Running javax.mail.internet.MimeMultipartParseTest
[INFO] Tests run: 2, Failures: 0, Errors: 0, Skipped: 0, Time elapsed: 5.046 s - in javax.mail.internet.MimeMultipartParseTest
[INFO] 
[INFO] Results:
[INFO] 
[ERROR] Failures: 
[ERROR]   WriteTimeoutSocketTest.testSSL:99->test:225 javax.mail.MessagingException: No appropriate protocol (protocol is disabled or cipher suites are inappropriate);
  nested exception is:
	javax.net.ssl.SSLHandshakeException: No appropriate protocol (protocol is disabled or cipher suites are inappropriate)
[ERROR]   WriteTimeoutSocketTest.testSSLSocketFactory:120->test:225 javax.mail.MessagingException: No appropriate protocol (protocol is disabled or cipher suites are inappropriate);
  nested exception is:
	javax.net.ssl.SSLHandshakeException: No appropriate protocol (protocol is disabled or cipher suites are inappropriate)
[INFO] 
[ERROR] Tests run: 1143, Failures: 2, Errors: 0, Skipped: 0
[INFO] 
[ERROR] There are test failures.

Please refer to /builddir/build/BUILD/javamail-1.6.3/mail/target/surefire-reports for the individual test results.
Please refer to dump files (if any exist) [date]-jvmRun[N].dump, [date].dumpstream and [date]-jvmRun[N].dumpstream.
[INFO] 
[INFO] --- maven-jar-plugin:3.1.0:jar (default-jar) @ jakarta.mail ---
[INFO] Building jar: /builddir/build/BUILD/javamail-1.6.3/mail/target/jakarta.mail.jar
[INFO] 
[INFO] --- maven-source-plugin:3.0.1:jar-no-fork (attach-sources) @ jakarta.mail ---
[INFO] Building jar: /builddir/build/BUILD/javamail-1.6.3/mail/target/jakarta.mail-1.6.3-sources.jar
[INFO] 
[INFO] ------------------------< com.sun.mail:servlet >------------------------
[INFO] Building JavaMail API demo servlet 1.6.3                          [3/11]
[INFO] --------------------------------[ jar ]---------------------------------
[INFO] 
[INFO] --- maven-enforcer-plugin:1.4.1:enforce (enforce-version) @ servlet ---
[INFO] 
[INFO] --- osgiversion-maven-plugin:2.4.0:compute-osgi-version (compute-osgi-version) @ servlet ---
[INFO] 
[INFO] --- build-helper-maven-plugin:1.9.1:add-source (add-source) @ servlet ---
[INFO] Source directory: /builddir/build/BUILD/javamail-1.6.3/servlet/target/sources added.
[INFO] Source directory: /builddir/build/BUILD/javamail-1.6.3/servlet/target/classes added.
[INFO] 
[INFO] --- maven-resources-plugin:3.1.0:resources (default-resources) @ servlet ---
[INFO] Using 'iso-8859-1' encoding to copy filtered resources.
[INFO] skip non existing resourceDirectory /builddir/build/BUILD/javamail-1.6.3/servlet/src/main/resources
[INFO] 
[INFO] --- maven-compiler-plugin:3.8.0:compile (default-compile) @ servlet ---
[INFO] Compiling 1 source file to /builddir/build/BUILD/javamail-1.6.3/servlet/target/classes
[INFO] /builddir/build/BUILD/javamail-1.6.3/servlet/src/main/java/JavaMailServlet.java: /builddir/build/BUILD/javamail-1.6.3/servlet/src/main/java/JavaMailServlet.java uses or overrides a deprecated API.
[INFO] /builddir/build/BUILD/javamail-1.6.3/servlet/src/main/java/JavaMailServlet.java: Recompile with -Xlint:deprecation for details.
[INFO] 
[INFO] --- maven-resources-plugin:3.1.0:testResources (default-testResources) @ servlet ---
[INFO] Using 'iso-8859-1' encoding to copy filtered resources.
[INFO] skip non existing resourceDirectory /builddir/build/BUILD/javamail-1.6.3/servlet/src/test/resources
[INFO] 
[INFO] --- maven-compiler-plugin:3.8.0:testCompile (default-testCompile) @ servlet ---
[INFO] No sources to compile
[INFO] 
[INFO] --- maven-surefire-plugin:2.22.0:test (default-test) @ servlet ---
[INFO] No tests to run.
[INFO] 
[INFO] --- maven-source-plugin:3.0.1:jar-no-fork (attach-sources) @ servlet ---
[INFO] Building jar: /builddir/build/BUILD/javamail-1.6.3/servlet/target/servlet-1.6.3-sources.jar
[INFO] 
[INFO] ------------------------< com.sun.mail:mailapi >------------------------
[INFO] Building JavaMail API (no providers) 1.6.3                        [4/11]
[INFO] --------------------------------[ jar ]---------------------------------
[INFO] 
[INFO] --- maven-enforcer-plugin:1.4.1:enforce (enforce-version) @ mailapi ---
[INFO] 
[INFO] --- osgiversion-maven-plugin:2.4.0:compute-osgi-version (compute-osgi-version) @ mailapi ---
[INFO] 
[INFO] --- maven-dependency-plugin:3.1.1:unpack (get-binaries) @ mailapi ---
[INFO] Configured Artifact: com.sun.mail:jakarta.mail:1.6.3:jar
[INFO] Unpacking /builddir/build/BUILD/javamail-1.6.3/mail/target/jakarta.mail.jar to /builddir/build/BUILD/javamail-1.6.3/mailapi/target/classes with includes "javax/**,com/sun/mail/util/**,com/sun/mail/auth/**,com/sun/mail/handlers/**,META-INF/*" and excludes "javax/mail/package.html,com/sun/mail/util/logging/**,META-INF/javamail.default.*"
[INFO] 
[INFO] --- maven-dependency-plugin:3.1.1:unpack (get-sources) @ mailapi ---
[INFO] Configured Artifact: com.sun.mail:jakarta.mail:sources:1.6.3:jar
[INFO] Unpacking /builddir/build/BUILD/javamail-1.6.3/mail/target/jakarta.mail-1.6.3-sources.jar to /builddir/build/BUILD/javamail-1.6.3/mailapi/target/sources with includes "javax/**,com/sun/mail/util/**,com/sun/mail/auth/**,com/sun/mail/handlers/**,META-INF/*" and excludes "javax/mail/package.html,com/sun/mail/util/logging/**,META-INF/javamail.default.*"
[INFO] 
[INFO] --- build-helper-maven-plugin:1.9.1:add-source (add-source) @ mailapi ---
[INFO] Source directory: /builddir/build/BUILD/javamail-1.6.3/mailapi/target/sources added.
[INFO] Source directory: /builddir/build/BUILD/javamail-1.6.3/mailapi/target/classes added.
[INFO] 
[INFO] --- maven-resources-plugin:3.1.0:resources (default-resources) @ mailapi ---
[INFO] Using 'iso-8859-1' encoding to copy filtered resources.
[INFO] skip non existing resourceDirectory /builddir/build/BUILD/javamail-1.6.3/mailapi/src/main/resources
[INFO] 
[INFO] --- maven-compiler-plugin:3.8.0:compile (default-compile) @ mailapi ---
[INFO] Nothing to compile - all classes are up to date
[INFO] 
[INFO] --- maven-bundle-plugin:3.5.1:manifest (osgi-manifest) @ mailapi ---
[INFO] 
[INFO] --- maven-resources-plugin:3.1.0:testResources (default-testResources) @ mailapi ---
[INFO] Using 'iso-8859-1' encoding to copy filtered resources.
[INFO] skip non existing resourceDirectory /builddir/build/BUILD/javamail-1.6.3/mailapi/src/test/resources
[INFO] 
[INFO] --- maven-compiler-plugin:3.8.0:testCompile (default-testCompile) @ mailapi ---
[INFO] No sources to compile
[INFO] 
[INFO] --- maven-surefire-plugin:2.22.0:test (default-test) @ mailapi ---
[INFO] No tests to run.
[INFO] 
[INFO] --- maven-jar-plugin:3.1.0:jar (default-jar) @ mailapi ---
[INFO] Building jar: /builddir/build/BUILD/javamail-1.6.3/mailapi/target/mailapi.jar
[INFO] 
[INFO] --- maven-source-plugin:3.0.1:jar-no-fork (attach-sources) @ mailapi ---
[INFO] Building jar: /builddir/build/BUILD/javamail-1.6.3/mailapi/target/mailapi-1.6.3-sources.jar
[INFO] 
[INFO] -------------------< jakarta.mail:jakarta.mail-api >--------------------
[INFO] Building JavaMail API jar 1.6.3                                   [5/11]
[INFO] --------------------------------[ jar ]---------------------------------
[INFO] 
[INFO] --- maven-enforcer-plugin:1.4.1:enforce (enforce-version) @ jakarta.mail-api ---
[INFO] 
[INFO] --- osgiversion-maven-plugin:2.4.0:compute-osgi-version (compute-osgi-version) @ jakarta.mail-api ---
[INFO] 
[INFO] --- build-helper-maven-plugin:1.9.1:add-source (add-source) @ jakarta.mail-api ---
[INFO] Source directory: /builddir/build/BUILD/javamail-1.6.3/mailapijar/target/sources added.
[INFO] Source directory: /builddir/build/BUILD/javamail-1.6.3/mailapijar/target/classes added.
[INFO] 
[INFO] --- maven-resources-plugin:3.1.0:resources (default-resources) @ jakarta.mail-api ---
[INFO] Using 'iso-8859-1' encoding to copy filtered resources.
[INFO] skip non existing resourceDirectory /builddir/build/BUILD/javamail-1.6.3/mailapijar/src/main/resources
[INFO] 
[INFO] --- maven-compiler-plugin:3.8.0:compile (default-compile) @ jakarta.mail-api ---
[INFO] No sources to compile
[INFO] 
[INFO] --- maven-dependency-plugin:3.1.1:unpack (get-binaries) @ jakarta.mail-api ---
[INFO] Configured Artifact: com.sun.mail:jakarta.mail:1.6.3:jar
[INFO] Unpacking /builddir/build/BUILD/javamail-1.6.3/mail/target/jakarta.mail.jar to /builddir/build/BUILD/javamail-1.6.3/mailapijar/target/classes with includes "javax/**,META-INF/LICENSE.txt" and excludes ""
[INFO] 
[INFO] --- maven-dependency-plugin:3.1.1:unpack (get-sources) @ jakarta.mail-api ---
[INFO] Configured Artifact: com.sun.mail:jakarta.mail:sources:1.6.3:jar
[INFO] Unpacking /builddir/build/BUILD/javamail-1.6.3/mail/target/jakarta.mail-1.6.3-sources.jar to /builddir/build/BUILD/javamail-1.6.3/mailapijar/target/sources with includes "javax/**,META-INF/LICENSE.txt" and excludes ""
[INFO] 
[INFO] --- maven-bundle-plugin:3.5.1:manifest (osgi-manifest) @ jakarta.mail-api ---
[INFO] 
[INFO] --- maven-resources-plugin:3.1.0:testResources (default-testResources) @ jakarta.mail-api ---
[INFO] Using 'iso-8859-1' encoding to copy filtered resources.
[INFO] skip non existing resourceDirectory /builddir/build/BUILD/javamail-1.6.3/mailapijar/src/test/resources
[INFO] 
[INFO] --- maven-compiler-plugin:3.8.0:testCompile (default-testCompile) @ jakarta.mail-api ---
[INFO] No sources to compile
[INFO] 
[INFO] --- maven-surefire-plugin:2.22.0:test (default-test) @ jakarta.mail-api ---
[INFO] No tests to run.
[INFO] 
[INFO] --- maven-jar-plugin:3.1.0:jar (default-jar) @ jakarta.mail-api ---
[INFO] Building jar: /builddir/build/BUILD/javamail-1.6.3/mailapijar/target/jakarta.mail-api.jar
[INFO] 
[INFO] --- maven-source-plugin:3.0.1:jar-no-fork (attach-sources) @ jakarta.mail-api ---
[INFO] Building jar: /builddir/build/BUILD/javamail-1.6.3/mailapijar/target/jakarta.mail-api-1.6.3-sources.jar
[INFO] 
[INFO] -------------------------< com.sun.mail:smtp >--------------------------
[INFO] Building JavaMail API smtp provider 1.6.3                         [6/11]
[INFO] --------------------------------[ jar ]---------------------------------
[INFO] 
[INFO] --- maven-enforcer-plugin:1.4.1:enforce (enforce-version) @ smtp ---
[INFO] 
[INFO] --- osgiversion-maven-plugin:2.4.0:compute-osgi-version (compute-osgi-version) @ smtp ---
[INFO] 
[INFO] --- build-helper-maven-plugin:1.9.1:add-source (add-source) @ smtp ---
[INFO] Source directory: /builddir/build/BUILD/javamail-1.6.3/smtp/target/sources added.
[INFO] Source directory: /builddir/build/BUILD/javamail-1.6.3/smtp/target/classes added.
[INFO] 
[INFO] --- maven-dependency-plugin:3.1.1:unpack (get-binaries) @ smtp ---
[INFO] Configured Artifact: com.sun.mail:jakarta.mail:1.6.3:jar
[INFO] Unpacking /builddir/build/BUILD/javamail-1.6.3/mail/target/jakarta.mail.jar to /builddir/build/BUILD/javamail-1.6.3/smtp/target/classes with includes "META-INF/LICENSE.txt,com/sun/mail/smtp/**,${mail.extraClasses}" and excludes ""
[INFO] 
[INFO] --- maven-dependency-plugin:3.1.1:unpack (get-sources) @ smtp ---
[INFO] Configured Artifact: com.sun.mail:jakarta.mail:sources:1.6.3:jar
[INFO] Unpacking /builddir/build/BUILD/javamail-1.6.3/mail/target/jakarta.mail-1.6.3-sources.jar to /builddir/build/BUILD/javamail-1.6.3/smtp/target/sources with includes "META-INF/LICENSE.txt,com/sun/mail/smtp/**,${mail.extraClasses}" and excludes ""
[INFO] 
[INFO] --- maven-resources-plugin:3.1.0:resources (default-resources) @ smtp ---
[INFO] Using 'iso-8859-1' encoding to copy filtered resources.
[INFO] Copying 4 resources
[INFO] 
[INFO] --- maven-compiler-plugin:3.8.0:compile (default-compile) @ smtp ---
[INFO] Nothing to compile - all classes are up to date
[INFO] 
[INFO] --- maven-bundle-plugin:3.5.1:manifest (osgi-manifest) @ smtp ---
[INFO] 
[INFO] --- maven-resources-plugin:3.1.0:testResources (default-testResources) @ smtp ---
[INFO] Using 'iso-8859-1' encoding to copy filtered resources.
[INFO] skip non existing resourceDirectory /builddir/build/BUILD/javamail-1.6.3/smtp/src/test/resources
[INFO] 
[INFO] --- maven-compiler-plugin:3.8.0:testCompile (default-testCompile) @ smtp ---
[INFO] No sources to compile
[INFO] 
[INFO] --- maven-surefire-plugin:2.22.0:test (default-test) @ smtp ---
[INFO] No tests to run.
[INFO] 
[INFO] --- maven-jar-plugin:3.1.0:jar (default-jar) @ smtp ---
[INFO] Building jar: /builddir/build/BUILD/javamail-1.6.3/smtp/target/smtp.jar
[INFO] 
[INFO] --- maven-source-plugin:3.0.1:jar-no-fork (attach-sources) @ smtp ---
[INFO] Building jar: /builddir/build/BUILD/javamail-1.6.3/smtp/target/smtp-1.6.3-sources.jar
[INFO] 
[INFO] -------------------------< com.sun.mail:imap >--------------------------
[INFO] Building JavaMail API imap provider 1.6.3                         [7/11]
[INFO] --------------------------------[ jar ]---------------------------------
[INFO] 
[INFO] --- maven-enforcer-plugin:1.4.1:enforce (enforce-version) @ imap ---
[INFO] 
[INFO] --- osgiversion-maven-plugin:2.4.0:compute-osgi-version (compute-osgi-version) @ imap ---
[INFO] 
[INFO] --- build-helper-maven-plugin:1.9.1:add-source (add-source) @ imap ---
[INFO] Source directory: /builddir/build/BUILD/javamail-1.6.3/imap/target/sources added.
[INFO] Source directory: /builddir/build/BUILD/javamail-1.6.3/imap/target/classes added.
[INFO] 
[INFO] --- maven-dependency-plugin:3.1.1:unpack (get-binaries) @ imap ---
[INFO] Configured Artifact: com.sun.mail:jakarta.mail:1.6.3:jar
[INFO] Unpacking /builddir/build/BUILD/javamail-1.6.3/mail/target/jakarta.mail.jar to /builddir/build/BUILD/javamail-1.6.3/imap/target/classes with includes "META-INF/LICENSE.txt,com/sun/mail/imap/**,com/sun/mail/iap/**" and excludes ""
[INFO] 
[INFO] --- maven-dependency-plugin:3.1.1:unpack (get-sources) @ imap ---
[INFO] Configured Artifact: com.sun.mail:jakarta.mail:sources:1.6.3:jar
[INFO] Unpacking /builddir/build/BUILD/javamail-1.6.3/mail/target/jakarta.mail-1.6.3-sources.jar to /builddir/build/BUILD/javamail-1.6.3/imap/target/sources with includes "META-INF/LICENSE.txt,com/sun/mail/imap/**,com/sun/mail/iap/**" and excludes ""
[INFO] 
[INFO] --- maven-resources-plugin:3.1.0:resources (default-resources) @ imap ---
[INFO] Using 'iso-8859-1' encoding to copy filtered resources.
[INFO] Copying 3 resources
[INFO] 
[INFO] --- maven-compiler-plugin:3.8.0:compile (default-compile) @ imap ---
[INFO] Nothing to compile - all classes are up to date
[INFO] 
[INFO] --- maven-bundle-plugin:3.5.1:manifest (osgi-manifest) @ imap ---
[INFO] 
[INFO] --- maven-resources-plugin:3.1.0:testResources (default-testResources) @ imap ---
[INFO] Using 'iso-8859-1' encoding to copy filtered resources.
[INFO] skip non existing resourceDirectory /builddir/build/BUILD/javamail-1.6.3/imap/src/test/resources
[INFO] 
[INFO] --- maven-compiler-plugin:3.8.0:testCompile (default-testCompile) @ imap ---
[INFO] No sources to compile
[INFO] 
[INFO] --- maven-surefire-plugin:2.22.0:test (default-test) @ imap ---
[INFO] No tests to run.
[INFO] 
[INFO] --- maven-jar-plugin:3.1.0:jar (default-jar) @ imap ---
[INFO] Building jar: /builddir/build/BUILD/javamail-1.6.3/imap/target/imap.jar
[INFO] 
[INFO] --- maven-source-plugin:3.0.1:jar-no-fork (attach-sources) @ imap ---
[INFO] Building jar: /builddir/build/BUILD/javamail-1.6.3/imap/target/imap-1.6.3-sources.jar
[INFO] 
[INFO] -------------------------< com.sun.mail:gimap >-------------------------
[INFO] Building JavaMail API Gmail IMAP provider 1.6.3                   [8/11]
[INFO] --------------------------------[ jar ]---------------------------------
[INFO] 
[INFO] --- maven-enforcer-plugin:1.4.1:enforce (enforce-version) @ gimap ---
[INFO] 
[INFO] --- osgiversion-maven-plugin:2.4.0:compute-osgi-version (compute-osgi-version) @ gimap ---
[INFO] 
[INFO] --- build-helper-maven-plugin:1.9.1:add-source (add-source) @ gimap ---
[INFO] Source directory: /builddir/build/BUILD/javamail-1.6.3/gimap/target/sources added.
[INFO] Source directory: /builddir/build/BUILD/javamail-1.6.3/gimap/target/classes added.
[INFO] 
[INFO] --- maven-resources-plugin:3.1.0:resources (default-resources) @ gimap ---
[INFO] Using 'iso-8859-1' encoding to copy filtered resources.
[INFO] Copying 3 resources
[INFO] 
[INFO] --- maven-compiler-plugin:3.8.0:compile (default-compile) @ gimap ---
[INFO] Compiling 12 source files to /builddir/build/BUILD/javamail-1.6.3/gimap/target/classes
[INFO] 
[INFO] --- maven-bundle-plugin:3.5.1:manifest (osgi-manifest) @ gimap ---
[INFO] 
[INFO] --- maven-resources-plugin:3.1.0:testResources (default-testResources) @ gimap ---
[INFO] Using 'iso-8859-1' encoding to copy filtered resources.
[INFO] skip non existing resourceDirectory /builddir/build/BUILD/javamail-1.6.3/gimap/src/test/resources
[INFO] 
[INFO] --- maven-compiler-plugin:3.8.0:testCompile (default-testCompile) @ gimap ---
[INFO] No sources to compile
[INFO] 
[INFO] --- maven-surefire-plugin:2.22.0:test (default-test) @ gimap ---
[INFO] No tests to run.
[INFO] 
[INFO] --- maven-jar-plugin:3.1.0:jar (default-jar) @ gimap ---
[INFO] Building jar: /builddir/build/BUILD/javamail-1.6.3/gimap/target/gimap.jar
[INFO] 
[INFO] --- maven-source-plugin:3.0.1:jar-no-fork (attach-sources) @ gimap ---
[INFO] Building jar: /builddir/build/BUILD/javamail-1.6.3/gimap/target/gimap-1.6.3-sources.jar
[INFO] 
[INFO] -------------------------< com.sun.mail:pop3 >--------------------------
[INFO] Building JavaMail API pop3 provider 1.6.3                         [9/11]
[INFO] --------------------------------[ jar ]---------------------------------
[INFO] 
[INFO] --- maven-enforcer-plugin:1.4.1:enforce (enforce-version) @ pop3 ---
[INFO] 
[INFO] --- osgiversion-maven-plugin:2.4.0:compute-osgi-version (compute-osgi-version) @ pop3 ---
[INFO] 
[INFO] --- build-helper-maven-plugin:1.9.1:add-source (add-source) @ pop3 ---
[INFO] Source directory: /builddir/build/BUILD/javamail-1.6.3/pop3/target/sources added.
[INFO] Source directory: /builddir/build/BUILD/javamail-1.6.3/pop3/target/classes added.
[INFO] 
[INFO] --- maven-dependency-plugin:3.1.1:unpack (get-binaries) @ pop3 ---
[INFO] Configured Artifact: com.sun.mail:jakarta.mail:1.6.3:jar
[INFO] Unpacking /builddir/build/BUILD/javamail-1.6.3/mail/target/jakarta.mail.jar to /builddir/build/BUILD/javamail-1.6.3/pop3/target/classes with includes "META-INF/LICENSE.txt,com/sun/mail/pop3/**,${mail.extraClasses}" and excludes ""
[INFO] 
[INFO] --- maven-dependency-plugin:3.1.1:unpack (get-sources) @ pop3 ---
[INFO] Configured Artifact: com.sun.mail:jakarta.mail:sources:1.6.3:jar
[INFO] Unpacking /builddir/build/BUILD/javamail-1.6.3/mail/target/jakarta.mail-1.6.3-sources.jar to /builddir/build/BUILD/javamail-1.6.3/pop3/target/sources with includes "META-INF/LICENSE.txt,com/sun/mail/pop3/**,${mail.extraClasses}" and excludes ""
[INFO] 
[INFO] --- maven-resources-plugin:3.1.0:resources (default-resources) @ pop3 ---
[INFO] Using 'iso-8859-1' encoding to copy filtered resources.
[INFO] Copying 3 resources
[INFO] 
[INFO] --- maven-compiler-plugin:3.8.0:compile (default-compile) @ pop3 ---
[INFO] Nothing to compile - all classes are up to date
[INFO] 
[INFO] --- maven-bundle-plugin:3.5.1:manifest (osgi-manifest) @ pop3 ---
[INFO] 
[INFO] --- maven-resources-plugin:3.1.0:testResources (default-testResources) @ pop3 ---
[INFO] Using 'iso-8859-1' encoding to copy filtered resources.
[INFO] skip non existing resourceDirectory /builddir/build/BUILD/javamail-1.6.3/pop3/src/test/resources
[INFO] 
[INFO] --- maven-compiler-plugin:3.8.0:testCompile (default-testCompile) @ pop3 ---
[INFO] No sources to compile
[INFO] 
[INFO] --- maven-surefire-plugin:2.22.0:test (default-test) @ pop3 ---
[INFO] No tests to run.
[INFO] 
[INFO] --- maven-jar-plugin:3.1.0:jar (default-jar) @ pop3 ---
[INFO] Building jar: /builddir/build/BUILD/javamail-1.6.3/pop3/target/pop3.jar
[INFO] 
[INFO] --- maven-source-plugin:3.0.1:jar-no-fork (attach-sources) @ pop3 ---
[INFO] Building jar: /builddir/build/BUILD/javamail-1.6.3/pop3/target/pop3-1.6.3-sources.jar
[INFO] 
[INFO] --------------------------< com.sun.mail:dsn >--------------------------
[INFO] Building JavaMail API dsn support 1.6.3                          [10/11]
[INFO] --------------------------------[ jar ]---------------------------------
[INFO] 
[INFO] --- maven-enforcer-plugin:1.4.1:enforce (enforce-version) @ dsn ---
[INFO] 
[INFO] --- osgiversion-maven-plugin:2.4.0:compute-osgi-version (compute-osgi-version) @ dsn ---
[INFO] 
[INFO] --- build-helper-maven-plugin:1.9.1:add-source (add-source) @ dsn ---
[INFO] Source directory: /builddir/build/BUILD/javamail-1.6.3/dsn/target/sources added.
[INFO] Source directory: /builddir/build/BUILD/javamail-1.6.3/dsn/target/classes added.
[INFO] 
[INFO] --- maven-resources-plugin:3.1.0:resources (default-resources) @ dsn ---
[INFO] Using 'iso-8859-1' encoding to copy filtered resources.
[INFO] Copying 2 resources
[INFO] 
[INFO] --- maven-compiler-plugin:3.8.0:compile (default-compile) @ dsn ---
[INFO] Compiling 9 source files to /builddir/build/BUILD/javamail-1.6.3/dsn/target/classes
[INFO] 
[INFO] --- maven-bundle-plugin:3.5.1:manifest (osgi-manifest) @ dsn ---
[INFO] 
[INFO] --- maven-resources-plugin:3.1.0:testResources (default-testResources) @ dsn ---
[INFO] Using 'iso-8859-1' encoding to copy filtered resources.
[INFO] skip non existing resourceDirectory /builddir/build/BUILD/javamail-1.6.3/dsn/src/test/resources
[INFO] 
[INFO] --- maven-compiler-plugin:3.8.0:testCompile (default-testCompile) @ dsn ---
[INFO] Changes detected - recompiling the module!
[INFO] Compiling 2 source files to /builddir/build/BUILD/javamail-1.6.3/dsn/target/test-classes
[INFO] 
[INFO] --- maven-surefire-plugin:2.22.0:test (default-test) @ dsn ---
[INFO] 
[INFO] -------------------------------------------------------
[INFO]  T E S T S
[INFO] -------------------------------------------------------
[INFO] Running com.sun.mail.dsn.MultipartReportTest
[INFO] Tests run: 1, Failures: 0, Errors: 0, Skipped: 0, Time elapsed: 0.116 s - in com.sun.mail.dsn.MultipartReportTest
[INFO] 
[INFO] Results:
[INFO] 
[INFO] Tests run: 1, Failures: 0, Errors: 0, Skipped: 0
[INFO] 
[INFO] 
[INFO] --- maven-jar-plugin:3.1.0:jar (default-jar) @ dsn ---
[INFO] Building jar: /builddir/build/BUILD/javamail-1.6.3/dsn/target/dsn.jar
[INFO] 
[INFO] --- maven-source-plugin:3.0.1:jar-no-fork (attach-sources) @ dsn ---
[INFO] Building jar: /builddir/build/BUILD/javamail-1.6.3/dsn/target/dsn-1.6.3-sources.jar
[INFO] 
[INFO] ------------------< com.sun.mail:logging-mailhandler >------------------
[INFO] Building JavaMail API logging handler 1.6.3                      [11/11]
[INFO] --------------------------------[ jar ]---------------------------------
[INFO] 
[INFO] --- maven-enforcer-plugin:1.4.1:enforce (enforce-version) @ logging-mailhandler ---
[INFO] 
[INFO] --- osgiversion-maven-plugin:2.4.0:compute-osgi-version (compute-osgi-version) @ logging-mailhandler ---
[INFO] 
[INFO] --- build-helper-maven-plugin:1.9.1:add-source (add-source) @ logging-mailhandler ---
[INFO] Source directory: /builddir/build/BUILD/javamail-1.6.3/mailhandler/target/sources added.
[INFO] Source directory: /builddir/build/BUILD/javamail-1.6.3/mailhandler/target/classes added.
[INFO] 
[INFO] --- maven-dependency-plugin:3.1.1:unpack (get-binaries) @ logging-mailhandler ---
[INFO] Configured Artifact: com.sun.mail:jakarta.mail:1.6.3:jar
[INFO] Unpacking /builddir/build/BUILD/javamail-1.6.3/mail/target/jakarta.mail.jar to /builddir/build/BUILD/javamail-1.6.3/mailhandler/target/classes with includes "META-INF/LICENSE.txt,com/sun/mail/util/logging/**,${mail.extraClasses}" and excludes ""
[INFO] 
[INFO] --- maven-dependency-plugin:3.1.1:unpack (get-sources) @ logging-mailhandler ---
[INFO] Configured Artifact: com.sun.mail:jakarta.mail:sources:1.6.3:jar
[INFO] Unpacking /builddir/build/BUILD/javamail-1.6.3/mail/target/jakarta.mail-1.6.3-sources.jar to /builddir/build/BUILD/javamail-1.6.3/mailhandler/target/sources with includes "META-INF/LICENSE.txt,com/sun/mail/util/logging/**,${mail.extraClasses}" and excludes ""
[INFO] 
[INFO] --- maven-resources-plugin:3.1.0:resources (default-resources) @ logging-mailhandler ---
[INFO] Using 'iso-8859-1' encoding to copy filtered resources.
[INFO] skip non existing resourceDirectory /builddir/build/BUILD/javamail-1.6.3/mailhandler/src/main/resources
[INFO] 
[INFO] --- maven-compiler-plugin:3.8.0:compile (default-compile) @ logging-mailhandler ---
[INFO] Nothing to compile - all classes are up to date
[INFO] 
[INFO] --- maven-bundle-plugin:3.5.1:manifest (osgi-manifest) @ logging-mailhandler ---
[INFO] 
[INFO] --- maven-resources-plugin:3.1.0:testResources (default-testResources) @ logging-mailhandler ---
[INFO] Using 'iso-8859-1' encoding to copy filtered resources.
[INFO] skip non existing resourceDirectory /builddir/build/BUILD/javamail-1.6.3/mailhandler/src/test/resources
[INFO] 
[INFO] --- maven-compiler-plugin:3.8.0:testCompile (default-testCompile) @ logging-mailhandler ---
[INFO] No sources to compile
[INFO] 
[INFO] --- maven-surefire-plugin:2.22.0:test (default-test) @ logging-mailhandler ---
[INFO] No tests to run.
[INFO] 
[INFO] --- maven-jar-plugin:3.1.0:jar (default-jar) @ logging-mailhandler ---
[INFO] Building jar: /builddir/build/BUILD/javamail-1.6.3/mailhandler/target/logging-mailhandler.jar
[INFO] 
[INFO] --- maven-source-plugin:3.0.1:jar-no-fork (attach-sources) @ logging-mailhandler ---
[INFO] Building jar: /builddir/build/BUILD/javamail-1.6.3/mailhandler/target/logging-mailhandler-1.6.3-sources.jar
[INFO] 
[INFO] --------------------------< com.sun.mail:all >--------------------------
[INFO] Building JavaMail API distribution 1.6.3                         [12/11]
[INFO] --------------------------------[ pom ]---------------------------------
[INFO] 
[INFO] --- xmvn-mojo:3.0.0:install (default-cli) @ all ---
[INFO] Skipping installation of artifact /builddir/build/BUILD/javamail-1.6.3/servlet/target/classes: artifact file is not a regular file
[INFO] 
[INFO] --- xmvn-mojo:3.0.0:builddep (default-cli) @ all ---
[INFO] ------------------------------------------------------------------------
[INFO] Reactor Summary:
[INFO] 
[INFO] JavaMail API distribution 1.6.3 .................... SUCCESS [  0.125 s]
[INFO] JavaMail API ....................................... SUCCESS [ 57.905 s]
[INFO] JavaMail API demo servlet .......................... SUCCESS [  0.198 s]
[INFO] JavaMail API (no providers) ........................ SUCCESS [  0.913 s]
[INFO] JavaMail API jar ................................... SUCCESS [  0.471 s]
[INFO] JavaMail API smtp provider ......................... SUCCESS [  0.256 s]
[INFO] JavaMail API imap provider ......................... SUCCESS [  0.373 s]
[INFO] JavaMail API Gmail IMAP provider ................... SUCCESS [  0.199 s]
[INFO] JavaMail API pop3 provider ......................... SUCCESS [  0.189 s]
[INFO] JavaMail API dsn support ........................... SUCCESS [ 10.249 s]
[INFO] JavaMail API logging handler 1.6.3 ................. SUCCESS [  0.222 s]
[INFO] ------------------------------------------------------------------------
[INFO] BUILD SUCCESS
[INFO] ------------------------------------------------------------------------
[INFO] Total time: 01:13 min
[INFO] Finished at: 2018-12-19T22:00:32Z
[INFO] ------------------------------------------------------------------------
[WARNING] The requested profile "deploy-snapshot" could not be activated because it does not exist.
-----BEGIN MAVEN BUILD DEPENDENCIES-----
H4sIAAAAAAACA8WTsW6DMBCG9zyFy27TdiZEbSeGTlGlrgYfxok5WzZG5O1rClXoQqsUqeOdP99/
/52dHYZWkx6cVwb3yQO7TwhgZYRCuU/ejvTp+FIUySHfZXeUkuegtCACLKCImAJPJCA43oEg5YW8
v/ZIKI30ksl3hFwTlzGMCelMsIXIjZOMW141wFreAzKrg1Tos/SLmHjuOlXzqouJT44C1sZV4Oh0
IUsXxKiYfpdc70Bq7n2tfMOa8+OKtPFSzeOiUxtbqN/k35sQ7W+iHxcODQ+eteZkVoTLcf+0AW3j
2De3X4NWw4+2y4BC/932KaDqVsTm85vL854PzIPrNazJzATlVv3DE7pW/NU8F9H4rT8ARJLdxj0E
AAA=
-----END MAVEN BUILD DEPENDENCIES-----
+ exit 0
Executing(%install): /bin/sh -e /var/tmp/rpm-tmp.DEq4On
+ umask 022
+ cd /builddir/build/BUILD
+ '[' /builddir/build/BUILDROOT/javamail-1.6.3-3.fc30.x86_64 '!=' / ']'
+ rm -rf /builddir/build/BUILDROOT/javamail-1.6.3-3.fc30.x86_64
++ dirname /builddir/build/BUILDROOT/javamail-1.6.3-3.fc30.x86_64
+ mkdir -p /builddir/build/BUILDROOT
+ mkdir /builddir/build/BUILDROOT/javamail-1.6.3-3.fc30.x86_64
+ cd javamail-1.6.3
+ xmvn-install -R .xmvn-reactor -n javamail -d /builddir/build/BUILDROOT/javamail-1.6.3-3.fc30.x86_64
[INFO] Installing artifact com.sun.mail:all:pom:1.6.3
[INFO] Installing artifact com.sun.mail:jakarta.mail:jar:1.6.3
[INFO] Installing artifact com.sun.mail:jakarta.mail:pom:1.6.3
[INFO] Installing artifact com.sun.mail:servlet:pom:1.6.3
[INFO] Installing artifact com.sun.mail:mailapi:jar:1.6.3
[INFO] Installing artifact com.sun.mail:mailapi:pom:1.6.3
[INFO] Installing artifact jakarta.mail:jakarta.mail-api:jar:1.6.3
[INFO] Installing artifact jakarta.mail:jakarta.mail-api:pom:1.6.3
[INFO] Installing artifact com.sun.mail:smtp:jar:1.6.3
[INFO] Installing artifact com.sun.mail:smtp:pom:1.6.3
[INFO] Installing artifact com.sun.mail:imap:jar:1.6.3
[INFO] Installing artifact com.sun.mail:imap:pom:1.6.3
[INFO] Installing artifact com.sun.mail:gimap:jar:1.6.3
[INFO] Installing artifact com.sun.mail:gimap:pom:1.6.3
[INFO] Installing artifact com.sun.mail:pop3:jar:1.6.3
[INFO] Installing artifact com.sun.mail:pop3:pom:1.6.3
[INFO] Installing artifact com.sun.mail:dsn:jar:1.6.3
[INFO] Installing artifact com.sun.mail:dsn:pom:1.6.3
[INFO] Installing artifact com.sun.mail:logging-mailhandler:jar:1.6.3
[INFO] Installing artifact com.sun.mail:logging-mailhandler:pom:1.6.3
[INFO] Installation successful
+ jdir=target/site/apidocs
+ '[' -d .xmvn/apidocs ']'
+ /usr/bin/mkdir -p /builddir/build/BUILDROOT/javamail-1.6.3-3.fc30.x86_64/usr/share/licenses
+ '[' -d target/site/apidocs ']'
+ install -d -m 755 /builddir/build/BUILDROOT/javamail-1.6.3-3.fc30.x86_64/usr/share/java/javax.mail/
+ ln -sf ../javamail/javax.mail.jar /builddir/build/BUILDROOT/javamail-1.6.3-3.fc30.x86_64/usr/share/java/javax.mail/
+ /usr/lib/rpm/find-debuginfo.sh -j2 --strict-build-id -m -i --build-id-seed 1.6.3-3.fc30 --unique-debug-suffix -1.6.3-3.fc30.x86_64 --unique-debug-src-base javamail-1.6.3-3.fc30.x86_64 --run-dwz --dwz-low-mem-die-limit 10000000 --dwz-max-die-limit 110000000 -S debugsourcefiles.list /builddir/build/BUILD/javamail-1.6.3
+ /usr/lib/rpm/check-buildroot
+ /usr/lib/rpm/redhat/brp-ldconfig
/sbin/ldconfig: Warning: ignoring configuration file that cannot be opened: /etc/ld.so.conf: No such file or directory
+ /usr/lib/rpm/brp-compress
+ /usr/lib/rpm/brp-strip-static-archive /usr/bin/strip
+ /usr/lib/rpm/brp-python-bytecompile /usr/bin/python 1 0
+ /usr/lib/rpm/brp-python-hardlink
+ /usr/lib/rpm/redhat/brp-mangle-shebangs
Processing files: javamail-1.6.3-3.fc30.noarch
Executing(%doc): /bin/sh -e /var/tmp/rpm-tmp.9hdnRP
+ umask 022
+ cd /builddir/build/BUILD
+ cd javamail-1.6.3
+ DOCDIR=/builddir/build/BUILDROOT/javamail-1.6.3-3.fc30.x86_64/usr/share/doc/javamail
+ export LC_ALL=C
+ LC_ALL=C
+ export DOCDIR
+ /usr/bin/mkdir -p /builddir/build/BUILDROOT/javamail-1.6.3-3.fc30.x86_64/usr/share/doc/javamail
+ cp -pr README.md /builddir/build/BUILDROOT/javamail-1.6.3-3.fc30.x86_64/usr/share/doc/javamail
+ exit 0
Executing(%license): /bin/sh -e /var/tmp/rpm-tmp.hs0WUh
+ umask 022
+ cd /builddir/build/BUILD
+ cd javamail-1.6.3
+ LICENSEDIR=/builddir/build/BUILDROOT/javamail-1.6.3-3.fc30.x86_64/usr/share/licenses/javamail
+ export LC_ALL=C
+ LC_ALL=C
+ export LICENSEDIR
+ /usr/bin/mkdir -p /builddir/build/BUILDROOT/javamail-1.6.3-3.fc30.x86_64/usr/share/licenses/javamail
+ cp -pr LICENSE.md /builddir/build/BUILDROOT/javamail-1.6.3-3.fc30.x86_64/usr/share/licenses/javamail
+ exit 0
[INFO osgi.prov] input: ['/builddir/build/BUILDROOT/javamail-1.6.3-3.fc30.x86_64/usr/share/java/javamail/dsn.jar']
[INFO osgi.prov] osgi(com.sun.mail.dsn) = 1.6.3
[INFO osgi.req] input: ['/builddir/build/BUILDROOT/javamail-1.6.3-3.fc30.x86_64/usr/share/java/javamail/dsn.jar']
[INFO osgi.prov] input: ['/builddir/build/BUILDROOT/javamail-1.6.3-3.fc30.x86_64/usr/share/java/javamail/gimap.jar']
[INFO osgi.prov] osgi(com.sun.mail.gimap) = 1.6.3
[INFO osgi.req] input: ['/builddir/build/BUILDROOT/javamail-1.6.3-3.fc30.x86_64/usr/share/java/javamail/gimap.jar']
[INFO osgi.prov] input: ['/builddir/build/BUILDROOT/javamail-1.6.3-3.fc30.x86_64/usr/share/java/javamail/imap.jar']
[INFO osgi.prov] osgi(com.sun.mail.imap) = 1.6.3
[INFO osgi.req] input: ['/builddir/build/BUILDROOT/javamail-1.6.3-3.fc30.x86_64/usr/share/java/javamail/imap.jar']
[INFO osgi.prov] input: ['/builddir/build/BUILDROOT/javamail-1.6.3-3.fc30.x86_64/usr/share/java/javamail/jakarta.mail-api.jar']
[INFO osgi.prov] osgi(jakarta.mail-api) = 1.6.3
[INFO osgi.req] input: ['/builddir/build/BUILDROOT/javamail-1.6.3-3.fc30.x86_64/usr/share/java/javamail/jakarta.mail-api.jar']
[INFO osgi.prov] input: ['/builddir/build/BUILDROOT/javamail-1.6.3-3.fc30.x86_64/usr/share/java/javamail/jakarta.mail.jar']
[INFO osgi.prov] osgi(com.sun.mail.jakarta.mail) = 1.6.3
[INFO osgi.req] input: ['/builddir/build/BUILDROOT/javamail-1.6.3-3.fc30.x86_64/usr/share/java/javamail/jakarta.mail.jar']
[INFO osgi.prov] input: ['/builddir/build/BUILDROOT/javamail-1.6.3-3.fc30.x86_64/usr/share/java/javamail/logging-mailhandler.jar']
[INFO osgi.prov] osgi(com.sun.mail.logging-mailhandler) = 1.6.3
[INFO osgi.req] input: ['/builddir/build/BUILDROOT/javamail-1.6.3-3.fc30.x86_64/usr/share/java/javamail/logging-mailhandler.jar']
[INFO osgi.prov] input: ['/builddir/build/BUILDROOT/javamail-1.6.3-3.fc30.x86_64/usr/share/java/javamail/mailapi.jar']
[INFO osgi.prov] osgi(jakarta.mail.api) = 1.6.3
[INFO osgi.req] input: ['/builddir/build/BUILDROOT/javamail-1.6.3-3.fc30.x86_64/usr/share/java/javamail/mailapi.jar']
[INFO osgi.prov] input: ['/builddir/build/BUILDROOT/javamail-1.6.3-3.fc30.x86_64/usr/share/java/javamail/pop3.jar']
[INFO osgi.prov] osgi(com.sun.mail.pop3) = 1.6.3
[INFO osgi.req] input: ['/builddir/build/BUILDROOT/javamail-1.6.3-3.fc30.x86_64/usr/share/java/javamail/pop3.jar']
[INFO osgi.prov] input: ['/builddir/build/BUILDROOT/javamail-1.6.3-3.fc30.x86_64/usr/share/java/javamail/smtp.jar']
[INFO osgi.prov] osgi(com.sun.mail.smtp) = 1.6.3
[INFO osgi.req] input: ['/builddir/build/BUILDROOT/javamail-1.6.3-3.fc30.x86_64/usr/share/java/javamail/smtp.jar']
[INFO osgi.prov] input: ['/builddir/build/BUILDROOT/javamail-1.6.3-3.fc30.x86_64/usr/share/java/javax.mail/javax.mail.jar']
[INFO osgi.req] input: ['/builddir/build/BUILDROOT/javamail-1.6.3-3.fc30.x86_64/usr/share/java/javax.mail/javax.mail.jar']
[INFO maven.prov] input: ['/builddir/build/BUILDROOT/javamail-1.6.3-3.fc30.x86_64/usr/share/maven-metadata/javamail.xml']
[INFO maven.prov] mvn(com.sun.mail:pop3:pom:) = 1.6.3, mvn(com.sun.mail:pop3) = 1.6.3, mvn(com.sun.mail:logging-mailhandler:pom:) = 1.6.3, mvn(com.sun.mail:logging-mailhandler) = 1.6.3, mvn(com.sun.mail:smtp) = 1.6.3, mvn(com.sun.mail:mailapi) = 1.6.3
mvn(javax.mail:mailapi) = 1.6.3, mvn(com.sun.mail:imap:pom:) = 1.6.3, mvn(com.sun.mail:smtp:pom:) = 1.6.3, mvn(com.sun.mail:gimap) = 1.6.3, mvn(com.sun.mail:mailapi:pom:) = 1.6.3
mvn(javax.mail:mailapi:pom:) = 1.6.3, mvn(com.sun.mail:jakarta.mail) = 1.6.3
mvn(com.sun.mail:javax.mail) = 1.6.3, mvn(jakarta.mail:jakarta.mail-api:pom:) = 1.6.3
mvn(javax.mail:javax.mail-api:pom:) = 1.6.3, mvn(com.sun.mail:gimap:pom:) = 1.6.3, mvn(com.sun.mail:dsn) = 1.6.3, mvn(com.sun.mail:jakarta.mail:pom:) = 1.6.3
mvn(com.sun.mail:javax.mail:pom:) = 1.6.3, mvn(com.sun.mail:imap) = 1.6.3, mvn(jakarta.mail:jakarta.mail-api) = 1.6.3
mvn(javax.mail:javax.mail-api) = 1.6.3, mvn(com.sun.mail:all:pom:) = 1.6.3, mvn(com.sun.mail:servlet:pom:) = 1.6.3, mvn(com.sun.mail:dsn:pom:) = 1.6.3
[INFO maven.req] input: ['/builddir/build/BUILDROOT/javamail-1.6.3-3.fc30.x86_64/usr/share/maven-metadata/javamail.xml']
[INFO maven.req] mvn(javax.servlet:servlet-api), javapackages-filesystem, java-headless >= 1:1.7
Provides: javamail = 1.6.3-3.fc30 javamail-monolithic = 1.6.3-3.fc30 javax.mail = 1.6.3-3.fc30 mvn(com.sun.mail:all:pom:) = 1.6.3 mvn(com.sun.mail:dsn) = 1.6.3 mvn(com.sun.mail:dsn:pom:) = 1.6.3 mvn(com.sun.mail:gimap) = 1.6.3 mvn(com.sun.mail:gimap:pom:) = 1.6.3 mvn(com.sun.mail:imap) = 1.6.3 mvn(com.sun.mail:imap:pom:) = 1.6.3 mvn(com.sun.mail:jakarta.mail) = 1.6.3 mvn(com.sun.mail:jakarta.mail:pom:) = 1.6.3 mvn(com.sun.mail:javax.mail) = 1.6.3 mvn(com.sun.mail:javax.mail:pom:) = 1.6.3 mvn(com.sun.mail:logging-mailhandler) = 1.6.3 mvn(com.sun.mail:logging-mailhandler:pom:) = 1.6.3 mvn(com.sun.mail:mailapi) = 1.6.3 mvn(com.sun.mail:mailapi:pom:) = 1.6.3 mvn(com.sun.mail:pop3) = 1.6.3 mvn(com.sun.mail:pop3:pom:) = 1.6.3 mvn(com.sun.mail:servlet:pom:) = 1.6.3 mvn(com.sun.mail:smtp) = 1.6.3 mvn(com.sun.mail:smtp:pom:) = 1.6.3 mvn(jakarta.mail:jakarta.mail-api) = 1.6.3 mvn(jakarta.mail:jakarta.mail-api:pom:) = 1.6.3 mvn(javax.mail:javax.mail-api) = 1.6.3 mvn(javax.mail:javax.mail-api:pom:) = 1.6.3 mvn(javax.mail:mailapi) = 1.6.3 mvn(javax.mail:mailapi:pom:) = 1.6.3 osgi(com.sun.mail.dsn) = 1.6.3 osgi(com.sun.mail.gimap) = 1.6.3 osgi(com.sun.mail.imap) = 1.6.3 osgi(com.sun.mail.jakarta.mail) = 1.6.3 osgi(com.sun.mail.logging-mailhandler) = 1.6.3 osgi(com.sun.mail.pop3) = 1.6.3 osgi(com.sun.mail.smtp) = 1.6.3 osgi(jakarta.mail-api) = 1.6.3 osgi(jakarta.mail.api) = 1.6.3
Requires(rpmlib): rpmlib(CompressedFileNames) <= 3.0.4-1 rpmlib(FileDigests) <= 4.6.0-1 rpmlib(PayloadFilesHavePrefix) <= 4.0-1
Requires: java-headless >= 1:1.7 javapackages-filesystem mvn(javax.servlet:servlet-api)
Checking for unpackaged file(s): /usr/lib/rpm/check-files /builddir/build/BUILDROOT/javamail-1.6.3-3.fc30.x86_64
Wrote: /builddir/build/RPMS/javamail-1.6.3-3.fc30.noarch.rpm
Executing(%clean): /bin/sh -e /var/tmp/rpm-tmp.H3jgRR
+ umask 022
+ cd /builddir/build/BUILD
+ cd javamail-1.6.3
+ /usr/bin/rm -rf /builddir/build/BUILDROOT/javamail-1.6.3-3.fc30.x86_64
+ exit 0
Finish: rpmbuild javamail-1.6.3-3.fc30.src.rpm
INFO: chroot_scan: 3 files copied to /var/lib/copr-rpmbuild/results/chroot_scan
INFO: /var/lib/mock/838767-fedora-rawhide-x86_64-1545256702.604392/root/var/log/dnf.log
/var/lib/mock/838767-fedora-rawhide-x86_64-1545256702.604392/root/var/log/dnf.librepo.log
/var/lib/mock/838767-fedora-rawhide-x86_64-1545256702.604392/root/var/log/dnf.rpm.log
Finish: build phase for javamail-1.6.3-3.fc30.src.rpm
INFO: Done(/var/lib/copr-rpmbuild/results/javamail-1.6.3-3.fc30.src.rpm) Config(child) 2 minutes 13 seconds
INFO: Results and/or logs in: /var/lib/copr-rpmbuild/results
INFO: Cleaning up build root ('cleanup_on_success=True')
Start: clean chroot
INFO: unmounting tmpfs.
Finish: clean chroot
Finish: run