Warning: Permanently added '2620:52:3:1:dead:beef:cafe:c1cc' (ED25519) to the list of known hosts.

You can reproduce this build on your computer by running:

  sudo dnf install copr-rpmbuild
  /usr/bin/copr-rpmbuild --verbose --drop-resultdir --task-url https://copr.fedorainfracloud.org/backend/get-build-task/8708832-epel-7-x86_64 --chroot epel-7-x86_64


Version: 1.2
PID: 8670
Logging PID: 8671
Task:
{'allow_user_ssh': False,
 'appstream': True,
 'background': False,
 'build_id': 8708832,
 'buildroot_pkgs': [],
 'chroot': 'epel-7-x86_64',
 'enable_net': True,
 'fedora_review': True,
 'git_hash': 'ed135548759686e4a7f4360607a9986dc25b64f0',
 'git_repo': 'https://copr-dist-git.fedorainfracloud.org/git/vandebugger/testing/ibus-stub',
 'isolation': 'default',
 'memory_reqs': 2048,
 'package_name': 'ibus-stub',
 'package_version': '0.0.1-0.vdb.2',
 'project_dirname': 'testing',
 'project_name': 'testing',
 'project_owner': 'vandebugger',
 'repo_priority': None,
 'repos': [{'baseurl': 'https://download.copr.fedorainfracloud.org/results/vandebugger/testing/epel-7-x86_64/',
            'id': 'copr_base',
            'name': 'Copr repository',
            'priority': None},
           {'baseurl': 'https://download.copr.fedorainfracloud.org/results/vandebugger/testing/epel-7-x86_64/',
            'id': 'copr_vandebugger_testing',
            'name': 'Additional repo copr_vandebugger_testing'}],
 'sandbox': 'vandebugger/testing--vandebugger',
 'source_json': {},
 'source_type': None,
 'ssh_public_keys': None,
 'storage': None,
 'submitter': 'vandebugger',
 'tags': [],
 'task_id': '8708832-epel-7-x86_64',
 'timeout': 18000,
 'uses_devel_repo': False,
 'with_opts': [],
 'without_opts': ['gnome_45', 'pandoc']}

Running: git clone https://copr-dist-git.fedorainfracloud.org/git/vandebugger/testing/ibus-stub /var/lib/copr-rpmbuild/workspace/workdir-u0rmh_2a/ibus-stub --depth 500 --no-single-branch --recursive

cmd: ['git', 'clone', 'https://copr-dist-git.fedorainfracloud.org/git/vandebugger/testing/ibus-stub', '/var/lib/copr-rpmbuild/workspace/workdir-u0rmh_2a/ibus-stub', '--depth', '500', '--no-single-branch', '--recursive']
cwd: .
rc: 0
stdout: 
stderr: Cloning into '/var/lib/copr-rpmbuild/workspace/workdir-u0rmh_2a/ibus-stub'...

Running: git checkout ed135548759686e4a7f4360607a9986dc25b64f0 --

cmd: ['git', 'checkout', 'ed135548759686e4a7f4360607a9986dc25b64f0', '--']
cwd: /var/lib/copr-rpmbuild/workspace/workdir-u0rmh_2a/ibus-stub
rc: 0
stdout: 
stderr: Note: switching to 'ed135548759686e4a7f4360607a9986dc25b64f0'.

You are in 'detached HEAD' state. You can look around, make experimental
changes and commit them, and you can discard any commits you make in this
state without impacting any branches by switching back to a branch.

If you want to create a new branch to retain commits you create, you may
do so (now or later) by using -c with the switch command. Example:

  git switch -c <new-branch-name>

Or undo this operation with:

  git switch -

Turn off this advice by setting config variable advice.detachedHead to false

HEAD is now at ed13554 automatic import of ibus-stub

Running: dist-git-client sources

cmd: ['dist-git-client', 'sources']
cwd: /var/lib/copr-rpmbuild/workspace/workdir-u0rmh_2a/ibus-stub
rc: 0
stdout: 
stderr: INFO: Reading stdout from command: git rev-parse --abbrev-ref HEAD
INFO: Reading stdout from command: git rev-parse HEAD
INFO: Reading sources specification file: sources

/usr/bin/tail: /var/lib/copr-rpmbuild/main.log: file truncated
Running (timeout=18000): unbuffer mock --spec /var/lib/copr-rpmbuild/workspace/workdir-u0rmh_2a/ibus-stub/ibus-stub.spec --sources /var/lib/copr-rpmbuild/workspace/workdir-u0rmh_2a/ibus-stub --resultdir /var/lib/copr-rpmbuild/results --uniqueext 1740730960.966604 -r /var/lib/copr-rpmbuild/results/configs/child.cfg --without gnome_45 --without pandoc
INFO: mock.py version 6.0 starting (python version = 3.13.0, NVR = mock-6.0-1.fc41), args: /usr/libexec/mock/mock --spec /var/lib/copr-rpmbuild/workspace/workdir-u0rmh_2a/ibus-stub/ibus-stub.spec --sources /var/lib/copr-rpmbuild/workspace/workdir-u0rmh_2a/ibus-stub --resultdir /var/lib/copr-rpmbuild/results --uniqueext 1740730960.966604 -r /var/lib/copr-rpmbuild/results/configs/child.cfg --without gnome_45 --without pandoc
Start(bootstrap): init plugins
INFO: tmpfs initialized
INFO: selinux enabled
INFO: chroot_scan: initialized
INFO: compress_logs: initialized
Finish(bootstrap): init plugins
Start: init plugins
INFO: tmpfs initialized
INFO: selinux enabled
INFO: chroot_scan: initialized
INFO: compress_logs: initialized
Finish: init plugins
INFO: Signal handler active
Start: run
INFO: Start(/var/lib/copr-rpmbuild/workspace/workdir-u0rmh_2a/ibus-stub/ibus-stub.spec)  Config(rhel+epel-7-x86_64)
Start: clean chroot
Finish: clean chroot
Mock Version: 6.0
INFO: Mock Version: 6.0
Start(bootstrap): chroot init
INFO: mounting tmpfs at /var/lib/mock/rhel+epel-7-x86_64-bootstrap-1740730960.966604/root.
INFO: calling preinit hooks
INFO: enabled root cache
INFO: enabled package manager cache
Start(bootstrap): cleaning package manager metadata
Finish(bootstrap): cleaning package manager metadata
INFO: Guessed host environment type: unknown
INFO: Using container image: registry.access.redhat.com/ubi7/ubi
INFO: Pulling image: registry.access.redhat.com/ubi7/ubi
INFO: Tagging container image as mock-bootstrap-5ee4cae7-773b-4cc7-97be-f129bfd6b6cd
INFO: Checking that a084eb42a557707d65c2bf0fcd683648c7d9fcbbb56e596f221903944eeff7e7 image matches host's architecture
INFO: Copy content of container a084eb42a557707d65c2bf0fcd683648c7d9fcbbb56e596f221903944eeff7e7 to /var/lib/mock/rhel+epel-7-x86_64-bootstrap-1740730960.966604/root
INFO: mounting a084eb42a557707d65c2bf0fcd683648c7d9fcbbb56e596f221903944eeff7e7 with podman image mount
INFO: image a084eb42a557707d65c2bf0fcd683648c7d9fcbbb56e596f221903944eeff7e7 as /var/lib/containers/storage/overlay/be1f7344519a2b9b41aa7154581b1b5503c2168abb3bc1edc99b656dca2426fe/merged
INFO: umounting image a084eb42a557707d65c2bf0fcd683648c7d9fcbbb56e596f221903944eeff7e7 (/var/lib/containers/storage/overlay/be1f7344519a2b9b41aa7154581b1b5503c2168abb3bc1edc99b656dca2426fe/merged) with podman image umount
INFO: Removing image mock-bootstrap-5ee4cae7-773b-4cc7-97be-f129bfd6b6cd
INFO: Package manager yum detected and used (fallback)
INFO: Bootstrap image not marked ready
Start(bootstrap): installing yum tooling
Failed to set locale, defaulting to C
copr_base                                                | 2.1 kB     00:00     
copr_vandebugger_testing                                 | 2.1 kB     00:00     
epel                                                     | 4.7 kB     00:00     
rhel                                                     | 3.5 kB     00:00     
rhel-optional                                            | 3.2 kB     00:00     
epel/x86_64/updateinfo         FAILED                                          
http://mirror.math.princeton.edu/pub/fedora-archive/epel/7/x86_64/repodata/a0880c46388d966fc93497d8c90f9d8e687135801fa63e49384a5081d5fdc089-updateinfo.xml.bz2: [Errno 14] HTTP Error 404 - Not Found
Trying other mirror.
To address this issue please refer to the below knowledge base article 

https://access.redhat.com/articles/1320623

If above article doesn't help to resolve this issue please open a ticket with Red Hat Support.

epel/x86_64/primary_db         FAILED                                          
http://pubmirror1.math.uh.edu/fedora-buffet/archive/epel/7/x86_64/repodata/42eb1ff7ad615cded6e0420ea690a68564807884fd427ffbcb85249b7e42c498-primary.sqlite.bz2: [Errno 14] HTTP Error 404 - Not Found
Trying other mirror.
(1/11): copr_vandebugger_testing/primary                   |  17 kB   00:00     
(2/11): copr_base/primary                                  |  17 kB   00:00     
(3/11): epel/x86_64/group_gz                               |  95 kB   00:00     
(4/11): rhel/7Server/x86_64/group                          | 631 kB   00:00     
(5/11): rhel/7Server/x86_64/updateinfo                     | 4.3 MB   00:00     
(6/11): rhel-optional/7Server/x86_64/updateinfo            | 3.1 MB   00:00     
epel/x86_64/primary_db         FAILED                                          
https://d2lzkl7pfhq30w.cloudfront.net/pub/archive/epel/7/x86_64/repodata/42eb1ff7ad615cded6e0420ea690a68564807884fd427ffbcb85249b7e42c498-primary.sqlite.bz2: [Errno 14] HTTPS Error 404 - Not Found
Trying other mirror.
(7/11): rhel-optional/7Server/x86_64/group                 |  22 kB   00:00     
(8/11): epel/x86_64/updateinfo                             | 1.0 MB   00:00     
(9/11): rhel-optional/7Server/x86_64/primary_db            | 9.8 MB   00:00     
(10/11): rhel/7Server/x86_64/primary_db                    |  96 MB   00:01     
epel/x86_64/primary_db         FAILED                                          
https://dl.fedoraproject.org/pub/archive/epel/7/x86_64/repodata/42eb1ff7ad615cded6e0420ea690a68564807884fd427ffbcb85249b7e42c498-primary.sqlite.bz2: [Errno 14] HTTPS Error 404 - Not Found
Trying other mirror.
(11/11): epel/x86_64/primary_db                            | 6.8 MB   00:00     
copr_base                                                                 76/76
copr_vandebugger_testing                                                  76/76
Package yum-3.4.3-168.el7.noarch already installed and latest version
Package yum-utils-1.1.31-54.el7_8.noarch already installed and latest version
Package subscription-manager-1.24.54-1.el7_9.x86_64 already installed and latest version
Nothing to do
Finish(bootstrap): installing yum tooling
Start(bootstrap): creating root cache
Finish(bootstrap): creating root cache
Finish(bootstrap): chroot init
Start: chroot init
INFO: mounting tmpfs at /var/lib/mock/rhel+epel-7-x86_64-1740730960.966604/root.
INFO: calling preinit hooks
INFO: enabled root cache
INFO: enabled package manager cache
Start: cleaning package manager metadata
Finish: cleaning package manager metadata
INFO: enabled HW Info plugin
INFO: Package manager yum detected and used (direct choice)
INFO: Buildroot is handled by package management downloaded with a bootstrap image:
  rpm-4.11.3-48.el7_9.x86_64
  yum-3.4.3-168.el7.noarch
  yum-utils-1.1.31-54.el7_8.noarch
Start: installing minimal buildroot with yum
Failed to set locale, defaulting to C
copr_base                                                | 2.1 kB     00:00     
copr_vandebugger_testing                                 | 2.1 kB     00:00     
epel                                                     | 4.7 kB     00:00     
rhel                                                     | 3.5 kB     00:00     
rhel-optional                                            | 3.2 kB     00:00     
copr_base                                                                 76/76
copr_vandebugger_testing                                                  76/76
Resolving Dependencies
--> Running transaction check
---> Package bash.x86_64 0:4.2.46-35.el7_9 will be installed
--> Processing Dependency: libc.so.6(GLIBC_2.11)(64bit) for package: bash-4.2.46-35.el7_9.x86_64
--> Processing Dependency: libc.so.6(GLIBC_2.14)(64bit) for package: bash-4.2.46-35.el7_9.x86_64
--> Processing Dependency: libc.so.6(GLIBC_2.15)(64bit) for package: bash-4.2.46-35.el7_9.x86_64
--> Processing Dependency: libc.so.6(GLIBC_2.2.5)(64bit) for package: bash-4.2.46-35.el7_9.x86_64
--> Processing Dependency: libc.so.6(GLIBC_2.3)(64bit) for package: bash-4.2.46-35.el7_9.x86_64
--> Processing Dependency: libc.so.6(GLIBC_2.3.4)(64bit) for package: bash-4.2.46-35.el7_9.x86_64
--> Processing Dependency: libc.so.6(GLIBC_2.4)(64bit) for package: bash-4.2.46-35.el7_9.x86_64
--> Processing Dependency: libc.so.6(GLIBC_2.8)(64bit) for package: bash-4.2.46-35.el7_9.x86_64
--> Processing Dependency: libdl.so.2(GLIBC_2.2.5)(64bit) for package: bash-4.2.46-35.el7_9.x86_64
--> Processing Dependency: rtld(GNU_HASH) for package: bash-4.2.46-35.el7_9.x86_64
--> Processing Dependency: libc.so.6()(64bit) for package: bash-4.2.46-35.el7_9.x86_64
--> Processing Dependency: libdl.so.2()(64bit) for package: bash-4.2.46-35.el7_9.x86_64
--> Processing Dependency: libtinfo.so.5()(64bit) for package: bash-4.2.46-35.el7_9.x86_64
---> Package bzip2.x86_64 0:1.0.6-13.el7 will be installed
--> Processing Dependency: bzip2-libs = 1.0.6-13.el7 for package: bzip2-1.0.6-13.el7.x86_64
--> Processing Dependency: libbz2.so.1()(64bit) for package: bzip2-1.0.6-13.el7.x86_64
---> Package coreutils.x86_64 0:8.22-24.el7_9.2 will be installed
--> Processing Dependency: gmp for package: coreutils-8.22-24.el7_9.2.x86_64
--> Processing Dependency: libacl.so.1(ACL_1.0)(64bit) for package: coreutils-8.22-24.el7_9.2.x86_64
--> Processing Dependency: libattr.so.1(ATTR_1.1)(64bit) for package: coreutils-8.22-24.el7_9.2.x86_64
--> Processing Dependency: libcrypto.so.10(libcrypto.so.10)(64bit) for package: coreutils-8.22-24.el7_9.2.x86_64
--> Processing Dependency: ncurses for package: coreutils-8.22-24.el7_9.2.x86_64
--> Processing Dependency: libacl.so.1()(64bit) for package: coreutils-8.22-24.el7_9.2.x86_64
--> Processing Dependency: libattr.so.1()(64bit) for package: coreutils-8.22-24.el7_9.2.x86_64
--> Processing Dependency: libcap.so.2()(64bit) for package: coreutils-8.22-24.el7_9.2.x86_64
--> Processing Dependency: libcrypto.so.10()(64bit) for package: coreutils-8.22-24.el7_9.2.x86_64
--> Processing Dependency: libgmp.so.10()(64bit) for package: coreutils-8.22-24.el7_9.2.x86_64
--> Processing Dependency: libselinux.so.1()(64bit) for package: coreutils-8.22-24.el7_9.2.x86_64
---> Package cpio.x86_64 0:2.11-28.el7 will be installed
---> Package diffutils.x86_64 0:3.3-6.el7_9 will be installed
---> Package epel-release.noarch 0:7-12 will be installed
--> Processing Dependency: redhat-release >= 7 for package: epel-release-7-12.noarch
---> Package epel-rpm-macros.noarch 0:7-23 will be installed
--> Processing Dependency: python-rpm-macros for package: epel-rpm-macros-7-23.noarch
--> Processing Dependency: python-srpm-macros for package: epel-rpm-macros-7-23.noarch
--> Processing Dependency: python2-rpm-macros for package: epel-rpm-macros-7-23.noarch
---> Package findutils.x86_64 1:4.5.11-6.el7 will be installed
---> Package gawk.x86_64 0:4.0.2-4.el7_3.1 will be installed
---> Package gcc.x86_64 0:4.8.5-44.el7 will be installed
--> Processing Dependency: cpp = 4.8.5-44.el7 for package: gcc-4.8.5-44.el7.x86_64
--> Processing Dependency: libgomp = 4.8.5-44.el7 for package: gcc-4.8.5-44.el7.x86_64
--> Processing Dependency: binutils >= 2.20.51.0.2-12 for package: gcc-4.8.5-44.el7.x86_64
--> Processing Dependency: glibc-devel >= 2.2.90-12 for package: gcc-4.8.5-44.el7.x86_64
--> Processing Dependency: libgcc >= 4.8.5-44.el7 for package: gcc-4.8.5-44.el7.x86_64
--> Processing Dependency: libgcc_s.so.1()(64bit) for package: gcc-4.8.5-44.el7.x86_64
--> Processing Dependency: libgomp.so.1()(64bit) for package: gcc-4.8.5-44.el7.x86_64
--> Processing Dependency: libmpc.so.3()(64bit) for package: gcc-4.8.5-44.el7.x86_64
--> Processing Dependency: libmpfr.so.4()(64bit) for package: gcc-4.8.5-44.el7.x86_64
--> Processing Dependency: libz.so.1()(64bit) for package: gcc-4.8.5-44.el7.x86_64
---> Package gcc-c++.x86_64 0:4.8.5-44.el7 will be installed
--> Processing Dependency: libstdc++ = 4.8.5-44.el7 for package: gcc-c++-4.8.5-44.el7.x86_64
--> Processing Dependency: libstdc++-devel = 4.8.5-44.el7 for package: gcc-c++-4.8.5-44.el7.x86_64
--> Processing Dependency: libstdc++.so.6()(64bit) for package: gcc-c++-4.8.5-44.el7.x86_64
---> Package grep.x86_64 0:2.20-3.el7 will be installed
--> Processing Dependency: libpcre.so.1()(64bit) for package: grep-2.20-3.el7.x86_64
---> Package gzip.x86_64 0:1.5-11.el7_9 will be installed
---> Package info.x86_64 0:5.1-5.el7 will be installed
---> Package make.x86_64 1:3.82-24.el7 will be installed
---> Package patch.x86_64 0:2.7.1-12.el7_7 will be installed
---> Package redhat-rpm-config.noarch 0:9.1.0-88.el7 will be installed
--> Processing Dependency: dwz >= 0.4 for package: redhat-rpm-config-9.1.0-88.el7.noarch
--> Processing Dependency: rpm >= 4.9.0 for package: redhat-rpm-config-9.1.0-88.el7.noarch
--> Processing Dependency: /usr/bin/perl for package: redhat-rpm-config-9.1.0-88.el7.noarch
--> Processing Dependency: perl(Getopt::Long) for package: redhat-rpm-config-9.1.0-88.el7.noarch
--> Processing Dependency: perl-srpm-macros for package: redhat-rpm-config-9.1.0-88.el7.noarch
--> Processing Dependency: zip for package: redhat-rpm-config-9.1.0-88.el7.noarch
---> Package rpm-build.x86_64 0:4.11.3-48.el7_9 will be installed
--> Processing Dependency: elfutils >= 0.128 for package: rpm-build-4.11.3-48.el7_9.x86_64
--> Processing Dependency: pkgconfig >= 1:0.24 for package: rpm-build-4.11.3-48.el7_9.x86_64
--> Processing Dependency: /usr/bin/gdb-add-index for package: rpm-build-4.11.3-48.el7_9.x86_64
--> Processing Dependency: file for package: rpm-build-4.11.3-48.el7_9.x86_64
--> Processing Dependency: libelf.so.1(ELFUTILS_1.0)(64bit) for package: rpm-build-4.11.3-48.el7_9.x86_64
--> Processing Dependency: libpopt.so.0(LIBPOPT_0)(64bit) for package: rpm-build-4.11.3-48.el7_9.x86_64
--> Processing Dependency: perl(File::Temp) for package: rpm-build-4.11.3-48.el7_9.x86_64
--> Processing Dependency: perl(Thread::Queue) for package: rpm-build-4.11.3-48.el7_9.x86_64
--> Processing Dependency: perl(threads) for package: rpm-build-4.11.3-48.el7_9.x86_64
--> Processing Dependency: libaudit.so.1()(64bit) for package: rpm-build-4.11.3-48.el7_9.x86_64
--> Processing Dependency: libdb-5.3.so()(64bit) for package: rpm-build-4.11.3-48.el7_9.x86_64
--> Processing Dependency: libelf.so.1()(64bit) for package: rpm-build-4.11.3-48.el7_9.x86_64
--> Processing Dependency: liblua-5.1.so()(64bit) for package: rpm-build-4.11.3-48.el7_9.x86_64
--> Processing Dependency: liblzma.so.5()(64bit) for package: rpm-build-4.11.3-48.el7_9.x86_64
--> Processing Dependency: libmagic.so.1()(64bit) for package: rpm-build-4.11.3-48.el7_9.x86_64
--> Processing Dependency: libnss3.so()(64bit) for package: rpm-build-4.11.3-48.el7_9.x86_64
--> Processing Dependency: libpopt.so.0()(64bit) for package: rpm-build-4.11.3-48.el7_9.x86_64
--> Processing Dependency: librpm.so.3()(64bit) for package: rpm-build-4.11.3-48.el7_9.x86_64
--> Processing Dependency: librpmbuild.so.3()(64bit) for package: rpm-build-4.11.3-48.el7_9.x86_64
--> Processing Dependency: librpmio.so.3()(64bit) for package: rpm-build-4.11.3-48.el7_9.x86_64
---> Package sed.x86_64 0:4.2.2-7.el7 will be installed
---> Package shadow-utils.x86_64 2:4.6-5.el7 will be installed
--> Processing Dependency: libsemanage.so.1(LIBSEMANAGE_1.0)(64bit) for package: 2:shadow-utils-4.6-5.el7.x86_64
--> Processing Dependency: setup for package: 2:shadow-utils-4.6-5.el7.x86_64
--> Processing Dependency: libsemanage.so.1()(64bit) for package: 2:shadow-utils-4.6-5.el7.x86_64
---> Package tar.x86_64 2:1.26-35.el7 will be installed
---> Package unzip.x86_64 0:6.0-24.el7_9 will be installed
---> Package util-linux.x86_64 0:2.23.2-65.el7_9.1 will be installed
--> Processing Dependency: libblkid = 2.23.2-65.el7_9.1 for package: util-linux-2.23.2-65.el7_9.1.x86_64
--> Processing Dependency: libmount = 2.23.2-65.el7_9.1 for package: util-linux-2.23.2-65.el7_9.1.x86_64
--> Processing Dependency: libsmartcols = 2.23.2-65.el7_9.1 for package: util-linux-2.23.2-65.el7_9.1.x86_64
--> Processing Dependency: libuuid = 2.23.2-65.el7_9.1 for package: util-linux-2.23.2-65.el7_9.1.x86_64
--> Processing Dependency: pam >= 1.1.3-7 for package: util-linux-2.23.2-65.el7_9.1.x86_64
--> Processing Dependency: /etc/pam.d/system-auth for package: util-linux-2.23.2-65.el7_9.1.x86_64
--> Processing Dependency: libblkid.so.1(BLKID_1.0)(64bit) for package: util-linux-2.23.2-65.el7_9.1.x86_64
--> Processing Dependency: libblkid.so.1(BLKID_2.15)(64bit) for package: util-linux-2.23.2-65.el7_9.1.x86_64
--> Processing Dependency: libblkid.so.1(BLKID_2.17)(64bit) for package: util-linux-2.23.2-65.el7_9.1.x86_64
--> Processing Dependency: libblkid.so.1(BLKID_2.18)(64bit) for package: util-linux-2.23.2-65.el7_9.1.x86_64
--> Processing Dependency: libblkid.so.1(BLKID_2.20)(64bit) for package: util-linux-2.23.2-65.el7_9.1.x86_64
--> Processing Dependency: libblkid.so.1(BLKID_2.21)(64bit) for package: util-linux-2.23.2-65.el7_9.1.x86_64
--> Processing Dependency: libmount.so.1(MOUNT_2.19)(64bit) for package: util-linux-2.23.2-65.el7_9.1.x86_64
--> Processing Dependency: libmount.so.1(MOUNT_2.20)(64bit) for package: util-linux-2.23.2-65.el7_9.1.x86_64
--> Processing Dependency: libmount.so.1(MOUNT_2.21)(64bit) for package: util-linux-2.23.2-65.el7_9.1.x86_64
--> Processing Dependency: libmount.so.1(MOUNT_2.22)(64bit) for package: util-linux-2.23.2-65.el7_9.1.x86_64
--> Processing Dependency: libmount.so.1(MOUNT_2.23)(64bit) for package: util-linux-2.23.2-65.el7_9.1.x86_64
--> Processing Dependency: libmount.so.1(MOUNT_2.25)(64bit) for package: util-linux-2.23.2-65.el7_9.1.x86_64
--> Processing Dependency: libpam.so.0(LIBPAM_1.0)(64bit) for package: util-linux-2.23.2-65.el7_9.1.x86_64
--> Processing Dependency: libpam_misc.so.0(LIBPAM_MISC_1.0)(64bit) for package: util-linux-2.23.2-65.el7_9.1.x86_64
--> Processing Dependency: libsmartcols.so.1(SMARTCOLS_2.25)(64bit) for package: util-linux-2.23.2-65.el7_9.1.x86_64
--> Processing Dependency: libsystemd.so.0(LIBSYSTEMD_209)(64bit) for package: util-linux-2.23.2-65.el7_9.1.x86_64
--> Processing Dependency: libudev.so.1(LIBUDEV_183)(64bit) for package: util-linux-2.23.2-65.el7_9.1.x86_64
--> Processing Dependency: libutempter.so.0(UTEMPTER_1.1)(64bit) for package: util-linux-2.23.2-65.el7_9.1.x86_64
--> Processing Dependency: libuuid.so.1(UUID_1.0)(64bit) for package: util-linux-2.23.2-65.el7_9.1.x86_64
--> Processing Dependency: libblkid.so.1()(64bit) for package: util-linux-2.23.2-65.el7_9.1.x86_64
--> Processing Dependency: libcap-ng.so.0()(64bit) for package: util-linux-2.23.2-65.el7_9.1.x86_64
--> Processing Dependency: libmount.so.1()(64bit) for package: util-linux-2.23.2-65.el7_9.1.x86_64
--> Processing Dependency: libpam.so.0()(64bit) for package: util-linux-2.23.2-65.el7_9.1.x86_64
--> Processing Dependency: libpam_misc.so.0()(64bit) for package: util-linux-2.23.2-65.el7_9.1.x86_64
--> Processing Dependency: libsmartcols.so.1()(64bit) for package: util-linux-2.23.2-65.el7_9.1.x86_64
--> Processing Dependency: libsystemd.so.0()(64bit) for package: util-linux-2.23.2-65.el7_9.1.x86_64
--> Processing Dependency: libudev.so.1()(64bit) for package: util-linux-2.23.2-65.el7_9.1.x86_64
--> Processing Dependency: libuser.so.1()(64bit) for package: util-linux-2.23.2-65.el7_9.1.x86_64
--> Processing Dependency: libutempter.so.0()(64bit) for package: util-linux-2.23.2-65.el7_9.1.x86_64
--> Processing Dependency: libuuid.so.1()(64bit) for package: util-linux-2.23.2-65.el7_9.1.x86_64
---> Package which.x86_64 0:2.20-7.el7 will be installed
---> Package xz.x86_64 0:5.2.2-2.el7_9 will be installed
--> Running transaction check
---> Package audit-libs.x86_64 0:2.8.5-4.el7 will be installed
---> Package binutils.x86_64 0:2.27-44.base.el7_9.1 will be installed
--> Processing Dependency: /usr/sbin/alternatives for package: binutils-2.27-44.base.el7_9.1.x86_64
--> Processing Dependency: /usr/sbin/alternatives for package: binutils-2.27-44.base.el7_9.1.x86_64
---> Package bzip2-libs.x86_64 0:1.0.6-13.el7 will be installed
---> Package cpp.x86_64 0:4.8.5-44.el7 will be installed
--> Processing Dependency: filesystem >= 3 for package: cpp-4.8.5-44.el7.x86_64
---> Package dwz.x86_64 0:0.11-3.el7 will be installed
---> Package elfutils.x86_64 0:0.176-5.el7 will be installed
--> Processing Dependency: elfutils-libs(x86-64) = 0.176-5.el7 for package: elfutils-0.176-5.el7.x86_64
--> Processing Dependency: libasm.so.1(ELFUTILS_1.0)(64bit) for package: elfutils-0.176-5.el7.x86_64
--> Processing Dependency: libdw.so.1(ELFUTILS_0.122)(64bit) for package: elfutils-0.176-5.el7.x86_64
--> Processing Dependency: libdw.so.1(ELFUTILS_0.126)(64bit) for package: elfutils-0.176-5.el7.x86_64
--> Processing Dependency: libdw.so.1(ELFUTILS_0.127)(64bit) for package: elfutils-0.176-5.el7.x86_64
--> Processing Dependency: libdw.so.1(ELFUTILS_0.130)(64bit) for package: elfutils-0.176-5.el7.x86_64
--> Processing Dependency: libdw.so.1(ELFUTILS_0.138)(64bit) for package: elfutils-0.176-5.el7.x86_64
--> Processing Dependency: libdw.so.1(ELFUTILS_0.148)(64bit) for package: elfutils-0.176-5.el7.x86_64
--> Processing Dependency: libdw.so.1(ELFUTILS_0.149)(64bit) for package: elfutils-0.176-5.el7.x86_64
--> Processing Dependency: libdw.so.1(ELFUTILS_0.158)(64bit) for package: elfutils-0.176-5.el7.x86_64
--> Processing Dependency: libdw.so.1(ELFUTILS_0.159)(64bit) for package: elfutils-0.176-5.el7.x86_64
--> Processing Dependency: libdw.so.1(ELFUTILS_0.160)(64bit) for package: elfutils-0.176-5.el7.x86_64
--> Processing Dependency: libdw.so.1(ELFUTILS_0.161)(64bit) for package: elfutils-0.176-5.el7.x86_64
--> Processing Dependency: libdw.so.1(ELFUTILS_0.165)(64bit) for package: elfutils-0.176-5.el7.x86_64
--> Processing Dependency: libdw.so.1(ELFUTILS_0.167)(64bit) for package: elfutils-0.176-5.el7.x86_64
--> Processing Dependency: libdw.so.1(ELFUTILS_0.171)(64bit) for package: elfutils-0.176-5.el7.x86_64
--> Processing Dependency: libdw.so.1(ELFUTILS_0.173)(64bit) for package: elfutils-0.176-5.el7.x86_64
--> Processing Dependency: libdw.so.1(ELFUTILS_0.175)(64bit) for package: elfutils-0.176-5.el7.x86_64
--> Processing Dependency: libasm.so.1()(64bit) for package: elfutils-0.176-5.el7.x86_64
--> Processing Dependency: libdw.so.1()(64bit) for package: elfutils-0.176-5.el7.x86_64
---> Package elfutils-libelf.x86_64 0:0.176-5.el7 will be installed
---> Package file.x86_64 0:5.11-37.el7 will be installed
---> Package file-libs.x86_64 0:5.11-37.el7 will be installed
---> Package gdb.x86_64 0:7.6.1-120.el7 will be installed
--> Processing Dependency: libexpat.so.1()(64bit) for package: gdb-7.6.1-120.el7.x86_64
--> Processing Dependency: libpython2.7.so.1.0()(64bit) for package: gdb-7.6.1-120.el7.x86_64
--> Processing Dependency: libreadline.so.6()(64bit) for package: gdb-7.6.1-120.el7.x86_64
---> Package glibc.x86_64 0:2.17-326.el7_9.3 will be installed
--> Processing Dependency: glibc-common = 2.17-326.el7_9.3 for package: glibc-2.17-326.el7_9.3.x86_64
--> Processing Dependency: basesystem for package: glibc-2.17-326.el7_9.3.x86_64
--> Processing Dependency: libfreebl3.so(NSSRAWHASH_3.12.3)(64bit) for package: glibc-2.17-326.el7_9.3.x86_64
--> Processing Dependency: libfreebl3.so()(64bit) for package: glibc-2.17-326.el7_9.3.x86_64
---> Package glibc-devel.x86_64 0:2.17-326.el7_9.3 will be installed
--> Processing Dependency: glibc-headers = 2.17-326.el7_9.3 for package: glibc-devel-2.17-326.el7_9.3.x86_64
--> Processing Dependency: glibc-headers for package: glibc-devel-2.17-326.el7_9.3.x86_64
---> Package gmp.x86_64 1:6.0.0-15.el7 will be installed
---> Package libacl.x86_64 0:2.2.51-15.el7 will be installed
---> Package libattr.x86_64 0:2.4.46-13.el7 will be installed
---> Package libblkid.x86_64 0:2.23.2-65.el7_9.1 will be installed
---> Package libcap.x86_64 0:2.22-11.el7 will be installed
---> Package libcap-ng.x86_64 0:0.7.5-4.el7 will be installed
---> Package libdb.x86_64 0:5.3.21-25.el7 will be installed
---> Package libgcc.x86_64 0:4.8.5-44.el7 will be installed
---> Package libgomp.x86_64 0:4.8.5-44.el7 will be installed
---> Package libmount.x86_64 0:2.23.2-65.el7_9.1 will be installed
---> Package libmpc.x86_64 0:1.0.1-3.el7 will be installed
---> Package libselinux.x86_64 0:2.5-15.el7 will be installed
--> Processing Dependency: libsepol(x86-64) >= 2.5-10 for package: libselinux-2.5-15.el7.x86_64
--> Processing Dependency: libsepol.so.1(LIBSEPOL_1.0)(64bit) for package: libselinux-2.5-15.el7.x86_64
--> Processing Dependency: libsepol.so.1()(64bit) for package: libselinux-2.5-15.el7.x86_64
---> Package libsemanage.x86_64 0:2.5-14.el7 will be installed
--> Processing Dependency: libustr-1.0.so.1(USTR_1.0)(64bit) for package: libsemanage-2.5-14.el7.x86_64
--> Processing Dependency: libustr-1.0.so.1(USTR_1.0.1)(64bit) for package: libsemanage-2.5-14.el7.x86_64
--> Processing Dependency: libustr-1.0.so.1()(64bit) for package: libsemanage-2.5-14.el7.x86_64
---> Package libsmartcols.x86_64 0:2.23.2-65.el7_9.1 will be installed
---> Package libstdc++.x86_64 0:4.8.5-44.el7 will be installed
---> Package libstdc++-devel.x86_64 0:4.8.5-44.el7 will be installed
---> Package libuser.x86_64 0:0.60-9.el7 will be installed
--> Processing Dependency: libglib-2.0.so.0()(64bit) for package: libuser-0.60-9.el7.x86_64
--> Processing Dependency: libgmodule-2.0.so.0()(64bit) for package: libuser-0.60-9.el7.x86_64
--> Processing Dependency: libgobject-2.0.so.0()(64bit) for package: libuser-0.60-9.el7.x86_64
--> Processing Dependency: libldap-2.4.so.2()(64bit) for package: libuser-0.60-9.el7.x86_64
---> Package libutempter.x86_64 0:1.1.6-4.el7 will be installed
---> Package libuuid.x86_64 0:2.23.2-65.el7_9.1 will be installed
---> Package lua.x86_64 0:5.1.4-15.el7 will be installed
---> Package mpfr.x86_64 0:3.1.1-4.el7 will be installed
---> Package ncurses.x86_64 0:5.9-14.20130511.el7_4 will be installed
---> Package ncurses-libs.x86_64 0:5.9-14.20130511.el7_4 will be installed
--> Processing Dependency: ncurses-base = 5.9-14.20130511.el7_4 for package: ncurses-libs-5.9-14.20130511.el7_4.x86_64
---> Package nss.x86_64 0:3.90.0-2.el7_9 will be installed
--> Processing Dependency: nspr >= 4.35.0 for package: nss-3.90.0-2.el7_9.x86_64
--> Processing Dependency: nss-softokn(x86-64) >= 3.90.0-1 for package: nss-3.90.0-2.el7_9.x86_64
--> Processing Dependency: nss-util >= 3.90.0-1 for package: nss-3.90.0-2.el7_9.x86_64
--> Processing Dependency: libnssutil3.so(NSSUTIL_3.12)(64bit) for package: nss-3.90.0-2.el7_9.x86_64
--> Processing Dependency: libnssutil3.so(NSSUTIL_3.12.3)(64bit) for package: nss-3.90.0-2.el7_9.x86_64
--> Processing Dependency: libnssutil3.so(NSSUTIL_3.12.5)(64bit) for package: nss-3.90.0-2.el7_9.x86_64
--> Processing Dependency: libnssutil3.so(NSSUTIL_3.13)(64bit) for package: nss-3.90.0-2.el7_9.x86_64
--> Processing Dependency: libnssutil3.so(NSSUTIL_3.14)(64bit) for package: nss-3.90.0-2.el7_9.x86_64
--> Processing Dependency: libnssutil3.so(NSSUTIL_3.15)(64bit) for package: nss-3.90.0-2.el7_9.x86_64
--> Processing Dependency: libnssutil3.so(NSSUTIL_3.17.1)(64bit) for package: nss-3.90.0-2.el7_9.x86_64
--> Processing Dependency: libnssutil3.so(NSSUTIL_3.21)(64bit) for package: nss-3.90.0-2.el7_9.x86_64
--> Processing Dependency: libnssutil3.so(NSSUTIL_3.24)(64bit) for package: nss-3.90.0-2.el7_9.x86_64
--> Processing Dependency: libnssutil3.so(NSSUTIL_3.31)(64bit) for package: nss-3.90.0-2.el7_9.x86_64
--> Processing Dependency: libnssutil3.so(NSSUTIL_3.38)(64bit) for package: nss-3.90.0-2.el7_9.x86_64
--> Processing Dependency: libnssutil3.so(NSSUTIL_3.39)(64bit) for package: nss-3.90.0-2.el7_9.x86_64
--> Processing Dependency: libnssutil3.so(NSSUTIL_3.59)(64bit) for package: nss-3.90.0-2.el7_9.x86_64
--> Processing Dependency: libnssutil3.so(NSSUTIL_3.82)(64bit) for package: nss-3.90.0-2.el7_9.x86_64
--> Processing Dependency: nss-pem(x86-64) for package: nss-3.90.0-2.el7_9.x86_64
--> Processing Dependency: nss-system-init for package: nss-3.90.0-2.el7_9.x86_64
--> Processing Dependency: libnspr4.so()(64bit) for package: nss-3.90.0-2.el7_9.x86_64
--> Processing Dependency: libnssutil3.so()(64bit) for package: nss-3.90.0-2.el7_9.x86_64
--> Processing Dependency: libplc4.so()(64bit) for package: nss-3.90.0-2.el7_9.x86_64
--> Processing Dependency: libplds4.so()(64bit) for package: nss-3.90.0-2.el7_9.x86_64
---> Package openssl-libs.x86_64 1:1.0.2k-26.el7_9 will be installed
--> Processing Dependency: ca-certificates >= 2008-5 for package: 1:openssl-libs-1.0.2k-26.el7_9.x86_64
--> Processing Dependency: libk5crypto.so.3(k5crypto_3_MIT)(64bit) for package: 1:openssl-libs-1.0.2k-26.el7_9.x86_64
--> Processing Dependency: libkrb5.so.3(krb5_3_MIT)(64bit) for package: 1:openssl-libs-1.0.2k-26.el7_9.x86_64
--> Processing Dependency: libcom_err.so.2()(64bit) for package: 1:openssl-libs-1.0.2k-26.el7_9.x86_64
--> Processing Dependency: libgssapi_krb5.so.2()(64bit) for package: 1:openssl-libs-1.0.2k-26.el7_9.x86_64
--> Processing Dependency: libk5crypto.so.3()(64bit) for package: 1:openssl-libs-1.0.2k-26.el7_9.x86_64
--> Processing Dependency: libkrb5.so.3()(64bit) for package: 1:openssl-libs-1.0.2k-26.el7_9.x86_64
---> Package pam.x86_64 0:1.1.8-23.el7 will be installed
--> Processing Dependency: cracklib-dicts >= 2.8 for package: pam-1.1.8-23.el7.x86_64
--> Processing Dependency: libpwquality >= 0.9.9 for package: pam-1.1.8-23.el7.x86_64
--> Processing Dependency: libcrack.so.2()(64bit) for package: pam-1.1.8-23.el7.x86_64
---> Package pcre.x86_64 0:8.32-17.el7 will be installed
---> Package perl.x86_64 4:5.16.3-299.el7_9 will be installed
--> Processing Dependency: perl-libs = 4:5.16.3-299.el7_9 for package: 4:perl-5.16.3-299.el7_9.x86_64
--> Processing Dependency: perl(Scalar::Util) >= 1.10 for package: 4:perl-5.16.3-299.el7_9.x86_64
--> Processing Dependency: perl(Socket) >= 1.3 for package: 4:perl-5.16.3-299.el7_9.x86_64
--> Processing Dependency: perl(Carp) for package: 4:perl-5.16.3-299.el7_9.x86_64
--> Processing Dependency: perl(Cwd) for package: 4:perl-5.16.3-299.el7_9.x86_64
--> Processing Dependency: perl(Exporter) for package: 4:perl-5.16.3-299.el7_9.x86_64
--> Processing Dependency: perl(File::Path) for package: 4:perl-5.16.3-299.el7_9.x86_64
--> Processing Dependency: perl(File::Spec) for package: 4:perl-5.16.3-299.el7_9.x86_64
--> Processing Dependency: perl(File::Spec::Functions) for package: 4:perl-5.16.3-299.el7_9.x86_64
--> Processing Dependency: perl(File::Spec::Unix) for package: 4:perl-5.16.3-299.el7_9.x86_64
--> Processing Dependency: perl(Filter::Util::Call) for package: 4:perl-5.16.3-299.el7_9.x86_64
--> Processing Dependency: perl(Pod::Simple::Search) for package: 4:perl-5.16.3-299.el7_9.x86_64
--> Processing Dependency: perl(Pod::Simple::XHTML) for package: 4:perl-5.16.3-299.el7_9.x86_64
--> Processing Dependency: perl(Scalar::Util) for package: 4:perl-5.16.3-299.el7_9.x86_64
--> Processing Dependency: perl(Socket) for package: 4:perl-5.16.3-299.el7_9.x86_64
--> Processing Dependency: perl(Storable) for package: 4:perl-5.16.3-299.el7_9.x86_64
--> Processing Dependency: perl(Time::HiRes) for package: 4:perl-5.16.3-299.el7_9.x86_64
--> Processing Dependency: perl(Time::Local) for package: 4:perl-5.16.3-299.el7_9.x86_64
--> Processing Dependency: perl(constant) for package: 4:perl-5.16.3-299.el7_9.x86_64
--> Processing Dependency: perl(threads::shared) for package: 4:perl-5.16.3-299.el7_9.x86_64
--> Processing Dependency: perl-libs for package: 4:perl-5.16.3-299.el7_9.x86_64
--> Processing Dependency: perl-macros for package: 4:perl-5.16.3-299.el7_9.x86_64
--> Processing Dependency: libgdbm.so.4()(64bit) for package: 4:perl-5.16.3-299.el7_9.x86_64
--> Processing Dependency: libgdbm_compat.so.4()(64bit) for package: 4:perl-5.16.3-299.el7_9.x86_64
--> Processing Dependency: libperl.so()(64bit) for package: 4:perl-5.16.3-299.el7_9.x86_64
---> Package perl-File-Temp.noarch 0:0.23.01-3.el7 will be installed
---> Package perl-Getopt-Long.noarch 0:2.40-3.el7 will be installed
--> Processing Dependency: perl(Pod::Usage) >= 1.14 for package: perl-Getopt-Long-2.40-3.el7.noarch
--> Processing Dependency: perl(Text::ParseWords) for package: perl-Getopt-Long-2.40-3.el7.noarch
---> Package perl-Thread-Queue.noarch 0:3.02-2.el7 will be installed
---> Package perl-srpm-macros.noarch 0:1-8.el7 will be installed
---> Package perl-threads.x86_64 0:1.87-4.el7 will be installed
---> Package pkgconfig.x86_64 1:0.27.1-4.el7 will be installed
---> Package popt.x86_64 0:1.13-16.el7 will be installed
---> Package python-rpm-macros.noarch 0:3-34.el7 will be installed
---> Package python-srpm-macros.noarch 0:3-34.el7 will be installed
---> Package python2-rpm-macros.noarch 0:3-34.el7 will be installed
---> Package redhat-release-server.x86_64 0:7.9-12.el7_9 will be installed
---> Package rpm.x86_64 0:4.11.3-48.el7_9 will be installed
--> Processing Dependency: /usr/bin/db_stat for package: rpm-4.11.3-48.el7_9.x86_64
--> Processing Dependency: curl for package: rpm-4.11.3-48.el7_9.x86_64
---> Package rpm-build-libs.x86_64 0:4.11.3-48.el7_9 will be installed
--> Processing Dependency: /usr/bin/gpg2 for package: rpm-build-libs-4.11.3-48.el7_9.x86_64
---> Package rpm-libs.x86_64 0:4.11.3-48.el7_9 will be installed
---> Package setup.noarch 0:2.8.71-11.el7 will be installed
---> Package systemd-libs.x86_64 0:219-78.el7_9.9 will be installed
--> Processing Dependency: libgcrypt.so.11(GCRYPT_1.2)(64bit) for package: systemd-libs-219-78.el7_9.9.x86_64
--> Processing Dependency: libgcrypt.so.11()(64bit) for package: systemd-libs-219-78.el7_9.9.x86_64
--> Processing Dependency: libgpg-error.so.0()(64bit) for package: systemd-libs-219-78.el7_9.9.x86_64
--> Processing Dependency: liblz4.so.1()(64bit) for package: systemd-libs-219-78.el7_9.9.x86_64
---> Package xz-libs.x86_64 0:5.2.2-2.el7_9 will be installed
---> Package zip.x86_64 0:3.0-11.el7 will be installed
---> Package zlib.x86_64 0:1.2.7-21.el7_9 will be installed
--> Running transaction check
---> Package basesystem.noarch 0:10.0-7.el7 will be installed
---> Package ca-certificates.noarch 0:2023.2.60_v7.0.306-72.el7_9 will be installed
--> Processing Dependency: p11-kit >= 0.23.5 for package: ca-certificates-2023.2.60_v7.0.306-72.el7_9.noarch
--> Processing Dependency: p11-kit-trust >= 0.23.5 for package: ca-certificates-2023.2.60_v7.0.306-72.el7_9.noarch
---> Package chkconfig.x86_64 0:1.7.6-1.el7 will be installed
---> Package cracklib.x86_64 0:2.9.0-11.el7 will be installed
---> Package cracklib-dicts.x86_64 0:2.9.0-11.el7 will be installed
---> Package curl.x86_64 0:7.29.0-59.el7_9.2 will be installed
--> Processing Dependency: libcurl = 7.29.0-59.el7_9.2 for package: curl-7.29.0-59.el7_9.2.x86_64
--> Processing Dependency: libcurl.so.4()(64bit) for package: curl-7.29.0-59.el7_9.2.x86_64
---> Package elfutils-libs.x86_64 0:0.176-5.el7 will be installed
--> Processing Dependency: default-yama-scope for package: elfutils-libs-0.176-5.el7.x86_64
---> Package expat.x86_64 0:2.1.0-15.el7_9 will be installed
---> Package filesystem.x86_64 0:3.2-25.el7 will be installed
---> Package gdbm.x86_64 0:1.10-8.el7 will be installed
---> Package glib2.x86_64 0:2.56.1-9.el7_9 will be installed
--> Processing Dependency: shared-mime-info for package: glib2-2.56.1-9.el7_9.x86_64
--> Processing Dependency: libffi.so.6()(64bit) for package: glib2-2.56.1-9.el7_9.x86_64
---> Package glibc-common.x86_64 0:2.17-326.el7_9.3 will be installed
--> Processing Dependency: tzdata >= 2003a for package: glibc-common-2.17-326.el7_9.3.x86_64
---> Package glibc-headers.x86_64 0:2.17-326.el7_9.3 will be installed
--> Processing Dependency: kernel-headers >= 2.2.1 for package: glibc-headers-2.17-326.el7_9.3.x86_64
--> Processing Dependency: kernel-headers for package: glibc-headers-2.17-326.el7_9.3.x86_64
---> Package gnupg2.x86_64 0:2.0.22-5.el7_5 will be installed
--> Processing Dependency: libassuan.so.0(LIBASSUAN_1.0)(64bit) for package: gnupg2-2.0.22-5.el7_5.x86_64
--> Processing Dependency: pinentry for package: gnupg2-2.0.22-5.el7_5.x86_64
--> Processing Dependency: libassuan.so.0()(64bit) for package: gnupg2-2.0.22-5.el7_5.x86_64
--> Processing Dependency: libpth.so.20()(64bit) for package: gnupg2-2.0.22-5.el7_5.x86_64
---> Package krb5-libs.x86_64 0:1.15.1-55.el7_9 will be installed
--> Processing Dependency: keyutils-libs >= 1.5.8 for package: krb5-libs-1.15.1-55.el7_9.x86_64
--> Processing Dependency: libkeyutils.so.1(KEYUTILS_0.3)(64bit) for package: krb5-libs-1.15.1-55.el7_9.x86_64
--> Processing Dependency: libkeyutils.so.1(KEYUTILS_1.0)(64bit) for package: krb5-libs-1.15.1-55.el7_9.x86_64
--> Processing Dependency: libkeyutils.so.1(KEYUTILS_1.5)(64bit) for package: krb5-libs-1.15.1-55.el7_9.x86_64
--> Processing Dependency: libkeyutils.so.1()(64bit) for package: krb5-libs-1.15.1-55.el7_9.x86_64
--> Processing Dependency: libverto.so.1()(64bit) for package: krb5-libs-1.15.1-55.el7_9.x86_64
---> Package libcom_err.x86_64 0:1.42.9-19.el7 will be installed
---> Package libdb-utils.x86_64 0:5.3.21-25.el7 will be installed
---> Package libgcrypt.x86_64 0:1.5.3-14.el7 will be installed
---> Package libgpg-error.x86_64 0:1.12-3.el7 will be installed
---> Package libpwquality.x86_64 0:1.2.3-5.el7 will be installed
---> Package libsepol.x86_64 0:2.5-10.el7 will be installed
---> Package lz4.x86_64 0:1.8.3-1.el7 will be installed
---> Package ncurses-base.noarch 0:5.9-14.20130511.el7_4 will be installed
---> Package nspr.x86_64 0:4.35.0-1.el7_9 will be installed
---> Package nss-pem.x86_64 0:1.0.3-7.el7_9.1 will be installed
---> Package nss-softokn.x86_64 0:3.90.0-6.el7_9 will be installed
--> Processing Dependency: libsqlite3.so.0()(64bit) for package: nss-softokn-3.90.0-6.el7_9.x86_64
---> Package nss-softokn-freebl.x86_64 0:3.90.0-6.el7_9 will be installed
---> Package nss-sysinit.x86_64 0:3.90.0-2.el7_9 will be installed
---> Package nss-util.x86_64 0:3.90.0-1.el7_9 will be installed
---> Package openldap.x86_64 0:2.4.44-25.el7_9 will be installed
--> Processing Dependency: nss-tools for package: openldap-2.4.44-25.el7_9.x86_64
--> Processing Dependency: libsasl2.so.3()(64bit) for package: openldap-2.4.44-25.el7_9.x86_64
---> Package perl-Carp.noarch 0:1.26-244.el7 will be installed
---> Package perl-Exporter.noarch 0:5.68-3.el7 will be installed
---> Package perl-File-Path.noarch 0:2.09-2.el7 will be installed
---> Package perl-Filter.x86_64 0:1.49-3.el7 will be installed
---> Package perl-PathTools.x86_64 0:3.40-5.el7 will be installed
---> Package perl-Pod-Simple.noarch 1:3.28-4.el7 will be installed
--> Processing Dependency: perl(Pod::Escapes) >= 1.04 for package: 1:perl-Pod-Simple-3.28-4.el7.noarch
--> Processing Dependency: perl(Encode) for package: 1:perl-Pod-Simple-3.28-4.el7.noarch
---> Package perl-Pod-Usage.noarch 0:1.63-3.el7 will be installed
--> Processing Dependency: perl(Pod::Text) >= 3.15 for package: perl-Pod-Usage-1.63-3.el7.noarch
--> Processing Dependency: perl-Pod-Perldoc for package: perl-Pod-Usage-1.63-3.el7.noarch
---> Package perl-Scalar-List-Utils.x86_64 0:1.27-248.el7 will be installed
---> Package perl-Socket.x86_64 0:2.010-5.el7 will be installed
---> Package perl-Storable.x86_64 0:2.45-3.el7 will be installed
---> Package perl-Text-ParseWords.noarch 0:3.29-4.el7 will be installed
---> Package perl-Time-HiRes.x86_64 4:1.9725-3.el7 will be installed
---> Package perl-Time-Local.noarch 0:1.2300-2.el7 will be installed
---> Package perl-constant.noarch 0:1.27-2.el7 will be installed
---> Package perl-libs.x86_64 4:5.16.3-299.el7_9 will be installed
---> Package perl-macros.x86_64 4:5.16.3-299.el7_9 will be installed
---> Package perl-threads-shared.x86_64 0:1.43-6.el7 will be installed
---> Package python-libs.x86_64 0:2.7.5-94.el7_9 will be installed
---> Package readline.x86_64 0:6.2-11.el7 will be installed
---> Package ustr.x86_64 0:1.0.4-16.el7 will be installed
--> Running transaction check
---> Package cyrus-sasl-lib.x86_64 0:2.1.26-24.el7_9 will be installed
---> Package elfutils-default-yama-scope.noarch 0:0.176-5.el7 will be installed
--> Processing Dependency: systemd for package: elfutils-default-yama-scope-0.176-5.el7.noarch
--> Processing Dependency: systemd for package: elfutils-default-yama-scope-0.176-5.el7.noarch
---> Package kernel-headers.x86_64 0:3.10.0-1160.119.1.el7 will be installed
---> Package keyutils-libs.x86_64 0:1.5.8-3.el7 will be installed
---> Package libassuan.x86_64 0:2.1.0-3.el7 will be installed
---> Package libcurl.x86_64 0:7.29.0-59.el7_9.2 will be installed
--> Processing Dependency: libssh2(x86-64) >= 1.8.0 for package: libcurl-7.29.0-59.el7_9.2.x86_64
--> Processing Dependency: libidn.so.11(LIBIDN_1.0)(64bit) for package: libcurl-7.29.0-59.el7_9.2.x86_64
--> Processing Dependency: libidn.so.11()(64bit) for package: libcurl-7.29.0-59.el7_9.2.x86_64
--> Processing Dependency: libssh2.so.1()(64bit) for package: libcurl-7.29.0-59.el7_9.2.x86_64
---> Package libffi.x86_64 0:3.0.13-19.el7 will be installed
---> Package libverto.x86_64 0:0.2.5-4.el7 will be installed
---> Package nss-tools.x86_64 0:3.90.0-2.el7_9 will be installed
---> Package p11-kit.x86_64 0:0.23.5-3.el7 will be installed
---> Package p11-kit-trust.x86_64 0:0.23.5-3.el7 will be installed
--> Processing Dependency: libtasn1.so.6(LIBTASN1_0_3)(64bit) for package: p11-kit-trust-0.23.5-3.el7.x86_64
--> Processing Dependency: libtasn1.so.6()(64bit) for package: p11-kit-trust-0.23.5-3.el7.x86_64
---> Package perl-Encode.x86_64 0:2.51-7.el7 will be installed
---> Package perl-Pod-Escapes.noarch 1:1.04-299.el7_9 will be installed
---> Package perl-Pod-Perldoc.noarch 0:3.20-4.el7 will be installed
--> Processing Dependency: groff-base for package: perl-Pod-Perldoc-3.20-4.el7.noarch
--> Processing Dependency: perl(HTTP::Tiny) for package: perl-Pod-Perldoc-3.20-4.el7.noarch
--> Processing Dependency: perl(parent) for package: perl-Pod-Perldoc-3.20-4.el7.noarch
---> Package perl-podlators.noarch 0:2.5.1-3.el7 will be installed
---> Package pinentry.x86_64 0:0.8.1-17.el7 will be installed
---> Package pth.x86_64 0:2.0.7-23.el7 will be installed
---> Package shared-mime-info.x86_64 0:1.8-5.el7 will be installed
--> Processing Dependency: libxml2.so.2(LIBXML2_2.4.30)(64bit) for package: shared-mime-info-1.8-5.el7.x86_64
--> Processing Dependency: libxml2.so.2()(64bit) for package: shared-mime-info-1.8-5.el7.x86_64
---> Package sqlite-libs.x86_64 0:3.34.0-1.vdb.1.el7 will be installed
---> Package tzdata.noarch 0:2024a-1.el7 will be installed
--> Running transaction check
---> Package groff-base.x86_64 0:1.22.2-8.el7 will be installed
---> Package libidn.x86_64 0:1.28-4.el7 will be installed
---> Package libssh2.x86_64 0:1.8.0-4.el7_9.1 will be installed
---> Package libtasn1.x86_64 0:4.10-1.el7 will be installed
---> Package libxml2.x86_64 0:2.9.1-6.el7_9.6 will be installed
---> Package perl-HTTP-Tiny.noarch 0:0.033-3.el7 will be installed
---> Package perl-parent.noarch 1:0.225-244.el7 will be installed
---> Package systemd.x86_64 0:219-78.el7_9.9 will be installed
--> Processing Dependency: kmod >= 18-4 for package: systemd-219-78.el7_9.9.x86_64
--> Processing Dependency: acl for package: systemd-219-78.el7_9.9.x86_64
--> Processing Dependency: dbus for package: systemd-219-78.el7_9.9.x86_64
--> Processing Dependency: libcryptsetup.so.12(CRYPTSETUP_2.0)(64bit) for package: systemd-219-78.el7_9.9.x86_64
--> Processing Dependency: libkmod.so.2(LIBKMOD_5)(64bit) for package: systemd-219-78.el7_9.9.x86_64
--> Processing Dependency: libcryptsetup.so.12()(64bit) for package: systemd-219-78.el7_9.9.x86_64
--> Processing Dependency: libkmod.so.2()(64bit) for package: systemd-219-78.el7_9.9.x86_64
--> Processing Dependency: libqrencode.so.3()(64bit) for package: systemd-219-78.el7_9.9.x86_64
--> Running transaction check
---> Package acl.x86_64 0:2.2.51-15.el7 will be installed
---> Package cryptsetup-libs.x86_64 0:2.0.3-6.el7 will be installed
--> Processing Dependency: libdevmapper.so.1.02(Base)(64bit) for package: cryptsetup-libs-2.0.3-6.el7.x86_64
--> Processing Dependency: libdevmapper.so.1.02(DM_1_02_97)(64bit) for package: cryptsetup-libs-2.0.3-6.el7.x86_64
--> Processing Dependency: libdevmapper.so.1.02()(64bit) for package: cryptsetup-libs-2.0.3-6.el7.x86_64
--> Processing Dependency: libjson-c.so.2()(64bit) for package: cryptsetup-libs-2.0.3-6.el7.x86_64
---> Package dbus.x86_64 1:1.10.24-15.el7 will be installed
--> Processing Dependency: dbus-libs(x86-64) = 1:1.10.24-15.el7 for package: 1:dbus-1.10.24-15.el7.x86_64
--> Processing Dependency: libdbus-1.so.3(LIBDBUS_1_3)(64bit) for package: 1:dbus-1.10.24-15.el7.x86_64
--> Processing Dependency: libdbus-1.so.3(LIBDBUS_PRIVATE_1.10.24)(64bit) for package: 1:dbus-1.10.24-15.el7.x86_64
--> Processing Dependency: libdbus-1.so.3()(64bit) for package: 1:dbus-1.10.24-15.el7.x86_64
---> Package kmod.x86_64 0:20-28.el7 will be installed
--> Processing Dependency: dracut for package: kmod-20-28.el7.x86_64
---> Package kmod-libs.x86_64 0:20-28.el7 will be installed
---> Package qrencode-libs.x86_64 0:3.4.1-3.el7 will be installed
--> Running transaction check
---> Package dbus-libs.x86_64 1:1.10.24-15.el7 will be installed
---> Package device-mapper-libs.x86_64 7:1.02.170-6.el7_9.5 will be installed
--> Processing Dependency: device-mapper = 7:1.02.170-6.el7_9.5 for package: 7:device-mapper-libs-1.02.170-6.el7_9.5.x86_64
---> Package dracut.x86_64 0:033-572.el7 will be installed
--> Processing Dependency: hardlink for package: dracut-033-572.el7.x86_64
--> Processing Dependency: kpartx for package: dracut-033-572.el7.x86_64
--> Processing Dependency: procps-ng for package: dracut-033-572.el7.x86_64
---> Package json-c.x86_64 0:0.11-4.el7_0 will be installed
--> Running transaction check
---> Package device-mapper.x86_64 7:1.02.170-6.el7_9.5 will be installed
---> Package hardlink.x86_64 1:1.0-19.el7 will be installed
---> Package kpartx.x86_64 0:0.4.9-136.el7_9 will be installed
---> Package procps-ng.x86_64 0:3.3.10-28.el7 will be installed
--> Finished Dependency Resolution

Dependencies Resolved

================================================================================
 Package                     Arch   Version                     Repository
                                                                           Size
================================================================================
Installing for group install "Buildsystem building group":
 bash                        x86_64 4.2.46-35.el7_9             rhel      1.0 M
 bzip2                       x86_64 1.0.6-13.el7                rhel       52 k
 coreutils                   x86_64 8.22-24.el7_9.2             rhel      3.3 M
 cpio                        x86_64 2.11-28.el7                 rhel      211 k
 diffutils                   x86_64 3.3-6.el7_9                 rhel      322 k
 epel-release                noarch 7-12                        epel       15 k
 epel-rpm-macros             noarch 7-23                        epel       15 k
 findutils                   x86_64 1:4.5.11-6.el7              rhel      559 k
 gawk                        x86_64 4.0.2-4.el7_3.1             rhel      874 k
 gcc                         x86_64 4.8.5-44.el7                rhel       16 M
 gcc-c++                     x86_64 4.8.5-44.el7                rhel      7.2 M
 grep                        x86_64 2.20-3.el7                  rhel      344 k
 gzip                        x86_64 1.5-11.el7_9                rhel      130 k
 info                        x86_64 5.1-5.el7                   rhel      233 k
 make                        x86_64 1:3.82-24.el7               rhel      421 k
 patch                       x86_64 2.7.1-12.el7_7              rhel      111 k
 redhat-rpm-config           noarch 9.1.0-88.el7                rhel       81 k
 rpm-build                   x86_64 4.11.3-48.el7_9             rhel      150 k
 sed                         x86_64 4.2.2-7.el7                 rhel      231 k
 shadow-utils                x86_64 2:4.6-5.el7                 rhel      1.2 M
 tar                         x86_64 2:1.26-35.el7               rhel      846 k
 unzip                       x86_64 6.0-24.el7_9                rhel      173 k
 util-linux                  x86_64 2.23.2-65.el7_9.1           rhel      2.0 M
 which                       x86_64 2.20-7.el7                  rhel       41 k
 xz                          x86_64 5.2.2-2.el7_9               rhel      229 k
Installing for dependencies:
 acl                         x86_64 2.2.51-15.el7               rhel       82 k
 audit-libs                  x86_64 2.8.5-4.el7                 rhel      102 k
 basesystem                  noarch 10.0-7.el7                  rhel      4.9 k
 binutils                    x86_64 2.27-44.base.el7_9.1        rhel      5.9 M
 bzip2-libs                  x86_64 1.0.6-13.el7                rhel       40 k
 ca-certificates             noarch 2023.2.60_v7.0.306-72.el7_9 rhel      923 k
 chkconfig                   x86_64 1.7.6-1.el7                 rhel      182 k
 cpp                         x86_64 4.8.5-44.el7                rhel      6.0 M
 cracklib                    x86_64 2.9.0-11.el7                rhel       80 k
 cracklib-dicts              x86_64 2.9.0-11.el7                rhel      3.6 M
 cryptsetup-libs             x86_64 2.0.3-6.el7                 rhel      339 k
 curl                        x86_64 7.29.0-59.el7_9.2           rhel      271 k
 cyrus-sasl-lib              x86_64 2.1.26-24.el7_9             rhel      156 k
 dbus                        x86_64 1:1.10.24-15.el7            rhel      245 k
 dbus-libs                   x86_64 1:1.10.24-15.el7            rhel      169 k
 device-mapper               x86_64 7:1.02.170-6.el7_9.5        rhel      297 k
 device-mapper-libs          x86_64 7:1.02.170-6.el7_9.5        rhel      325 k
 dracut                      x86_64 033-572.el7                 rhel      329 k
 dwz                         x86_64 0.11-3.el7                  rhel       99 k
 elfutils                    x86_64 0.176-5.el7                 rhel      308 k
 elfutils-default-yama-scope noarch 0.176-5.el7                 rhel       33 k
 elfutils-libelf             x86_64 0.176-5.el7                 rhel      195 k
 elfutils-libs               x86_64 0.176-5.el7                 rhel      291 k
 expat                       x86_64 2.1.0-15.el7_9              rhel       83 k
 file                        x86_64 5.11-37.el7                 rhel       57 k
 file-libs                   x86_64 5.11-37.el7                 rhel      340 k
 filesystem                  x86_64 3.2-25.el7                  rhel      1.0 M
 gdb                         x86_64 7.6.1-120.el7               rhel      2.4 M
 gdbm                        x86_64 1.10-8.el7                  rhel       70 k
 glib2                       x86_64 2.56.1-9.el7_9              rhel      2.5 M
 glibc                       x86_64 2.17-326.el7_9.3            rhel      3.6 M
 glibc-common                x86_64 2.17-326.el7_9.3            rhel       12 M
 glibc-devel                 x86_64 2.17-326.el7_9.3            rhel      1.1 M
 glibc-headers               x86_64 2.17-326.el7_9.3            rhel      692 k
 gmp                         x86_64 1:6.0.0-15.el7              rhel      281 k
 gnupg2                      x86_64 2.0.22-5.el7_5              rhel      1.5 M
 groff-base                  x86_64 1.22.2-8.el7                rhel      942 k
 hardlink                    x86_64 1:1.0-19.el7                rhel       14 k
 json-c                      x86_64 0.11-4.el7_0                rhel       31 k
 kernel-headers              x86_64 3.10.0-1160.119.1.el7       rhel      9.1 M
 keyutils-libs               x86_64 1.5.8-3.el7                 rhel       25 k
 kmod                        x86_64 20-28.el7                   rhel      123 k
 kmod-libs                   x86_64 20-28.el7                   rhel       51 k
 kpartx                      x86_64 0.4.9-136.el7_9             rhel       81 k
 krb5-libs                   x86_64 1.15.1-55.el7_9             rhel      810 k
 libacl                      x86_64 2.2.51-15.el7               rhel       27 k
 libassuan                   x86_64 2.1.0-3.el7                 rhel       63 k
 libattr                     x86_64 2.4.46-13.el7               rhel       18 k
 libblkid                    x86_64 2.23.2-65.el7_9.1           rhel      183 k
 libcap                      x86_64 2.22-11.el7                 rhel       47 k
 libcap-ng                   x86_64 0.7.5-4.el7                 rhel       25 k
 libcom_err                  x86_64 1.42.9-19.el7               rhel       42 k
 libcurl                     x86_64 7.29.0-59.el7_9.2           rhel      223 k
 libdb                       x86_64 5.3.21-25.el7               rhel      719 k
 libdb-utils                 x86_64 5.3.21-25.el7               rhel      133 k
 libffi                      x86_64 3.0.13-19.el7               rhel       30 k
 libgcc                      x86_64 4.8.5-44.el7                rhel      103 k
 libgcrypt                   x86_64 1.5.3-14.el7                rhel      263 k
 libgomp                     x86_64 4.8.5-44.el7                rhel      159 k
 libgpg-error                x86_64 1.12-3.el7                  rhel       87 k
 libidn                      x86_64 1.28-4.el7                  rhel      209 k
 libmount                    x86_64 2.23.2-65.el7_9.1           rhel      185 k
 libmpc                      x86_64 1.0.1-3.el7                 rhel       51 k
 libpwquality                x86_64 1.2.3-5.el7                 rhel       85 k
 libselinux                  x86_64 2.5-15.el7                  rhel      162 k
 libsemanage                 x86_64 2.5-14.el7                  rhel      151 k
 libsepol                    x86_64 2.5-10.el7                  rhel      297 k
 libsmartcols                x86_64 2.23.2-65.el7_9.1           rhel      143 k
 libssh2                     x86_64 1.8.0-4.el7_9.1             rhel       88 k
 libstdc++                   x86_64 4.8.5-44.el7                rhel      306 k
 libstdc++-devel             x86_64 4.8.5-44.el7                rhel      1.5 M
 libtasn1                    x86_64 4.10-1.el7                  rhel      320 k
 libuser                     x86_64 0.60-9.el7                  rhel      400 k
 libutempter                 x86_64 1.1.6-4.el7                 rhel       25 k
 libuuid                     x86_64 2.23.2-65.el7_9.1           rhel       84 k
 libverto                    x86_64 0.2.5-4.el7                 rhel       16 k
 libxml2                     x86_64 2.9.1-6.el7_9.6             rhel      668 k
 lua                         x86_64 5.1.4-15.el7                rhel      201 k
 lz4                         x86_64 1.8.3-1.el7                 rhel       85 k
 mpfr                        x86_64 3.1.1-4.el7                 rhel      203 k
 ncurses                     x86_64 5.9-14.20130511.el7_4       rhel      304 k
 ncurses-base                noarch 5.9-14.20130511.el7_4       rhel       68 k
 ncurses-libs                x86_64 5.9-14.20130511.el7_4       rhel      316 k
 nspr                        x86_64 4.35.0-1.el7_9              rhel      128 k
 nss                         x86_64 3.90.0-2.el7_9              rhel      905 k
 nss-pem                     x86_64 1.0.3-7.el7_9.1             rhel       75 k
 nss-softokn                 x86_64 3.90.0-6.el7_9              rhel      384 k
 nss-softokn-freebl          x86_64 3.90.0-6.el7_9              rhel      321 k
 nss-sysinit                 x86_64 3.90.0-2.el7_9              rhel       67 k
 nss-tools                   x86_64 3.90.0-2.el7_9              rhel      557 k
 nss-util                    x86_64 3.90.0-1.el7_9              rhel       80 k
 openldap                    x86_64 2.4.44-25.el7_9             rhel      356 k
 openssl-libs                x86_64 1:1.0.2k-26.el7_9           rhel      1.2 M
 p11-kit                     x86_64 0.23.5-3.el7                rhel      252 k
 p11-kit-trust               x86_64 0.23.5-3.el7                rhel      129 k
 pam                         x86_64 1.1.8-23.el7                rhel      721 k
 pcre                        x86_64 8.32-17.el7                 rhel      422 k
 perl                        x86_64 4:5.16.3-299.el7_9          rhel      8.0 M
 perl-Carp                   noarch 1.26-244.el7                rhel       19 k
 perl-Encode                 x86_64 2.51-7.el7                  rhel      1.5 M
 perl-Exporter               noarch 5.68-3.el7                  rhel       28 k
 perl-File-Path              noarch 2.09-2.el7                  rhel       27 k
 perl-File-Temp              noarch 0.23.01-3.el7               rhel       56 k
 perl-Filter                 x86_64 1.49-3.el7                  rhel       76 k
 perl-Getopt-Long            noarch 2.40-3.el7                  rhel       56 k
 perl-HTTP-Tiny              noarch 0.033-3.el7                 rhel       38 k
 perl-PathTools              x86_64 3.40-5.el7                  rhel       83 k
 perl-Pod-Escapes            noarch 1:1.04-299.el7_9            rhel       52 k
 perl-Pod-Perldoc            noarch 3.20-4.el7                  rhel       87 k
 perl-Pod-Simple             noarch 1:3.28-4.el7                rhel      216 k
 perl-Pod-Usage              noarch 1.63-3.el7                  rhel       27 k
 perl-Scalar-List-Utils      x86_64 1.27-248.el7                rhel       36 k
 perl-Socket                 x86_64 2.010-5.el7                 rhel       49 k
 perl-Storable               x86_64 2.45-3.el7                  rhel       77 k
 perl-Text-ParseWords        noarch 3.29-4.el7                  rhel       14 k
 perl-Thread-Queue           noarch 3.02-2.el7                  rhel       17 k
 perl-Time-HiRes             x86_64 4:1.9725-3.el7              rhel       45 k
 perl-Time-Local             noarch 1.2300-2.el7                rhel       24 k
 perl-constant               noarch 1.27-2.el7                  rhel       19 k
 perl-libs                   x86_64 4:5.16.3-299.el7_9          rhel      690 k
 perl-macros                 x86_64 4:5.16.3-299.el7_9          rhel       44 k
 perl-parent                 noarch 1:0.225-244.el7             rhel       12 k
 perl-podlators              noarch 2.5.1-3.el7                 rhel      112 k
 perl-srpm-macros            noarch 1-8.el7                     rhel      4.7 k
 perl-threads                x86_64 1.87-4.el7                  rhel       49 k
 perl-threads-shared         x86_64 1.43-6.el7                  rhel       39 k
 pinentry                    x86_64 0.8.1-17.el7                rhel       73 k
 pkgconfig                   x86_64 1:0.27.1-4.el7              rhel       54 k
 popt                        x86_64 1.13-16.el7                 rhel       42 k
 procps-ng                   x86_64 3.3.10-28.el7               rhel      291 k
 pth                         x86_64 2.0.7-23.el7                rhel       89 k
 python-libs                 x86_64 2.7.5-94.el7_9              rhel      5.6 M
 python-rpm-macros           noarch 3-34.el7                    rhel      9.1 k
 python-srpm-macros          noarch 3-34.el7                    rhel      8.8 k
 python2-rpm-macros          noarch 3-34.el7                    rhel      8.1 k
 qrencode-libs               x86_64 3.4.1-3.el7                 rhel       50 k
 readline                    x86_64 6.2-11.el7                  rhel      193 k
 redhat-release-server       x86_64 7.9-12.el7_9                rhel       32 k
 rpm                         x86_64 4.11.3-48.el7_9             rhel      1.2 M
 rpm-build-libs              x86_64 4.11.3-48.el7_9             rhel      108 k
 rpm-libs                    x86_64 4.11.3-48.el7_9             rhel      279 k
 setup                       noarch 2.8.71-11.el7               rhel      166 k
 shared-mime-info            x86_64 1.8-5.el7                   rhel      312 k
 sqlite-libs                 x86_64 3.34.0-1.vdb.1.el7          copr_base 592 k
 systemd                     x86_64 219-78.el7_9.9              rhel      5.1 M
 systemd-libs                x86_64 219-78.el7_9.9              rhel      419 k
 tzdata                      noarch 2024a-1.el7                 rhel      497 k
 ustr                        x86_64 1.0.4-16.el7                rhel       92 k
 xz-libs                     x86_64 5.2.2-2.el7_9               rhel      103 k
 zip                         x86_64 3.0-11.el7                  rhel      260 k
 zlib                        x86_64 1.2.7-21.el7_9              rhel       90 k

Transaction Summary
================================================================================
Install  25 Packages (+151 Dependent packages)

Total download size: 132 M
Installed size: 565 M
Downloading packages:
warning: /var/lib/mock/rhel+epel-7-x86_64-1740730960.966604/root/var/cache/yum/rhel/packages/audit-libs-2.8.5-4.el7.x86_64.rpm: Header V3 RSA/SHA256 Signature, key ID fd431d51: NOKEY
Public key for audit-libs-2.8.5-4.el7.x86_64.rpm is not installed
(1/176): audit-libs-2.8.5-4.el7.x86_64.rpm                 | 102 kB   00:00     
(2/176): acl-2.2.51-15.el7.x86_64.rpm                      |  82 kB   00:00     
(3/176): basesystem-10.0-7.el7.noarch.rpm                  | 4.9 kB   00:00     
(4/176): bash-4.2.46-35.el7_9.x86_64.rpm                   | 1.0 MB   00:00     
(5/176): bzip2-1.0.6-13.el7.x86_64.rpm                     |  52 kB   00:00     
(6/176): binutils-2.27-44.base.el7_9.1.x86_64.rpm          | 5.9 MB   00:00     
(7/176): bzip2-libs-1.0.6-13.el7.x86_64.rpm                |  40 kB   00:00     
(8/176): ca-certificates-2023.2.60_v7.0.306-72.el7_9.noarc | 923 kB   00:00     
(9/176): chkconfig-1.7.6-1.el7.x86_64.rpm                  | 182 kB   00:00     
(10/176): coreutils-8.22-24.el7_9.2.x86_64.rpm             | 3.3 MB   00:00     
(11/176): cpio-2.11-28.el7.x86_64.rpm                      | 211 kB   00:00     
(12/176): cpp-4.8.5-44.el7.x86_64.rpm                      | 6.0 MB   00:00     
(13/176): cracklib-2.9.0-11.el7.x86_64.rpm                 |  80 kB   00:00     
(14/176): cryptsetup-libs-2.0.3-6.el7.x86_64.rpm           | 339 kB   00:00     
(15/176): cracklib-dicts-2.9.0-11.el7.x86_64.rpm           | 3.6 MB   00:00     
(16/176): curl-7.29.0-59.el7_9.2.x86_64.rpm                | 271 kB   00:00     
(17/176): cyrus-sasl-lib-2.1.26-24.el7_9.x86_64.rpm        | 156 kB   00:00     
(18/176): dbus-1.10.24-15.el7.x86_64.rpm                   | 245 kB   00:00     
(19/176): device-mapper-1.02.170-6.el7_9.5.x86_64.rpm      | 297 kB   00:00     
(20/176): dbus-libs-1.10.24-15.el7.x86_64.rpm              | 169 kB   00:00     
(21/176): device-mapper-libs-1.02.170-6.el7_9.5.x86_64.rpm | 325 kB   00:00     
(22/176): diffutils-3.3-6.el7_9.x86_64.rpm                 | 322 kB   00:00     
(23/176): dracut-033-572.el7.x86_64.rpm                    | 329 kB   00:00     
(24/176): dwz-0.11-3.el7.x86_64.rpm                        |  99 kB   00:00     
(25/176): elfutils-0.176-5.el7.x86_64.rpm                  | 308 kB   00:00     
(26/176): elfutils-default-yama-scope-0.176-5.el7.noarch.r |  33 kB   00:00     
(27/176): elfutils-libelf-0.176-5.el7.x86_64.rpm           | 195 kB   00:00     
epel-rpm-macros-7-23.noarch.rp FAILED                                          
http://pubmirror1.math.uh.edu/fedora-buffet/archive/epel/7/x86_64/Packages/e/epel-rpm-macros-7-23.noarch.rpm: [Errno 14] HTTP Error 404 - Not Found
Trying other mirror.
To address this issue please refer to the below knowledge base article 

https://access.redhat.com/articles/1320623

If above article doesn't help to resolve this issue please open a ticket with Red Hat Support.

(28/176): elfutils-libs-0.176-5.el7.x86_64.rpm             | 291 kB   00:00     
(29/176): expat-2.1.0-15.el7_9.x86_64.rpm                  |  83 kB   00:00     
Public key for epel-release-7-12.noarch.rpm is not installedwarning: /var/lib/mock/rhel+epel-7-x86_64-1740730960.966604/root/var/cache/yum/epel/packages/epel-release-7-12.noarch.rpm: Header V3 RSA/SHA256 Signature, key ID 352c64e5: NOKEY

(30/176): epel-release-7-12.noarch.rpm                     |  15 kB   00:00     
(31/176): file-5.11-37.el7.x86_64.rpm                      |  57 kB   00:00     
(32/176): file-libs-5.11-37.el7.x86_64.rpm                 | 340 kB   00:00     
(33/176): filesystem-3.2-25.el7.x86_64.rpm                 | 1.0 MB   00:00     
(34/176): findutils-4.5.11-6.el7.x86_64.rpm                | 559 kB   00:00     
(35/176): gawk-4.0.2-4.el7_3.1.x86_64.rpm                  | 874 kB   00:00     
(36/176): gcc-4.8.5-44.el7.x86_64.rpm                      |  16 MB   00:00     
(37/176): gcc-c++-4.8.5-44.el7.x86_64.rpm                  | 7.2 MB   00:00     
(38/176): gdb-7.6.1-120.el7.x86_64.rpm                     | 2.4 MB   00:00     
(39/176): gdbm-1.10-8.el7.x86_64.rpm                       |  70 kB   00:00     
(40/176): glib2-2.56.1-9.el7_9.x86_64.rpm                  | 2.5 MB   00:00     
(41/176): glibc-2.17-326.el7_9.3.x86_64.rpm                | 3.6 MB   00:00     
(42/176): glibc-devel-2.17-326.el7_9.3.x86_64.rpm          | 1.1 MB   00:00     
(43/176): glibc-common-2.17-326.el7_9.3.x86_64.rpm         |  12 MB   00:00     
(44/176): glibc-headers-2.17-326.el7_9.3.x86_64.rpm        | 692 kB   00:00     
(45/176): gmp-6.0.0-15.el7.x86_64.rpm                      | 281 kB   00:00     
(46/176): gnupg2-2.0.22-5.el7_5.x86_64.rpm                 | 1.5 MB   00:00     
(47/176): grep-2.20-3.el7.x86_64.rpm                       | 344 kB   00:00     
(48/176): groff-base-1.22.2-8.el7.x86_64.rpm               | 942 kB   00:00     
(49/176): gzip-1.5-11.el7_9.x86_64.rpm                     | 130 kB   00:00     
(50/176): hardlink-1.0-19.el7.x86_64.rpm                   |  14 kB   00:00     
(51/176): info-5.1-5.el7.x86_64.rpm                        | 233 kB   00:00     
(52/176): json-c-0.11-4.el7_0.x86_64.rpm                   |  31 kB   00:00     
(53/176): keyutils-libs-1.5.8-3.el7.x86_64.rpm             |  25 kB   00:00     
(54/176): kernel-headers-3.10.0-1160.119.1.el7.x86_64.rpm  | 9.1 MB   00:00     
(55/176): kmod-20-28.el7.x86_64.rpm                        | 123 kB   00:00     
(56/176): kmod-libs-20-28.el7.x86_64.rpm                   |  51 kB   00:00     
(57/176): kpartx-0.4.9-136.el7_9.x86_64.rpm                |  81 kB   00:00     
(58/176): krb5-libs-1.15.1-55.el7_9.x86_64.rpm             | 810 kB   00:00     
(59/176): libacl-2.2.51-15.el7.x86_64.rpm                  |  27 kB   00:00     
(60/176): libassuan-2.1.0-3.el7.x86_64.rpm                 |  63 kB   00:00     
(61/176): libattr-2.4.46-13.el7.x86_64.rpm                 |  18 kB   00:00     
(62/176): libcap-2.22-11.el7.x86_64.rpm                    |  47 kB   00:00     
(63/176): libblkid-2.23.2-65.el7_9.1.x86_64.rpm            | 183 kB   00:00     
(64/176): libcap-ng-0.7.5-4.el7.x86_64.rpm                 |  25 kB   00:00     
(65/176): libcom_err-1.42.9-19.el7.x86_64.rpm              |  42 kB   00:00     
(66/176): libcurl-7.29.0-59.el7_9.2.x86_64.rpm             | 223 kB   00:00     
(67/176): libdb-5.3.21-25.el7.x86_64.rpm                   | 719 kB   00:00     
(68/176): libdb-utils-5.3.21-25.el7.x86_64.rpm             | 133 kB   00:00     
(69/176): libffi-3.0.13-19.el7.x86_64.rpm                  |  30 kB   00:00     
(70/176): libgcc-4.8.5-44.el7.x86_64.rpm                   | 103 kB   00:00     
(71/176): libgcrypt-1.5.3-14.el7.x86_64.rpm                | 263 kB   00:00     
(72/176): libgomp-4.8.5-44.el7.x86_64.rpm                  | 159 kB   00:00     
(73/176): libgpg-error-1.12-3.el7.x86_64.rpm               |  87 kB   00:00     
(74/176): libidn-1.28-4.el7.x86_64.rpm                     | 209 kB   00:00     
(75/176): libmount-2.23.2-65.el7_9.1.x86_64.rpm            | 185 kB   00:00     
(76/176): libmpc-1.0.1-3.el7.x86_64.rpm                    |  51 kB   00:00     
(77/176): libpwquality-1.2.3-5.el7.x86_64.rpm              |  85 kB   00:00     
(78/176): libselinux-2.5-15.el7.x86_64.rpm                 | 162 kB   00:00     
(79/176): libsemanage-2.5-14.el7.x86_64.rpm                | 151 kB   00:00     
(80/176): libsepol-2.5-10.el7.x86_64.rpm                   | 297 kB   00:00     
(81/176): libsmartcols-2.23.2-65.el7_9.1.x86_64.rpm        | 143 kB   00:00     
(82/176): libssh2-1.8.0-4.el7_9.1.x86_64.rpm               |  88 kB   00:00     
(83/176): libstdc++-4.8.5-44.el7.x86_64.rpm                | 306 kB   00:00     
(84/176): libstdc++-devel-4.8.5-44.el7.x86_64.rpm          | 1.5 MB   00:00     
(85/176): libtasn1-4.10-1.el7.x86_64.rpm                   | 320 kB   00:00     
(86/176): libutempter-1.1.6-4.el7.x86_64.rpm               |  25 kB   00:00     
(87/176): libuser-0.60-9.el7.x86_64.rpm                    | 400 kB   00:00     
(88/176): libverto-0.2.5-4.el7.x86_64.rpm                  |  16 kB   00:00     
(89/176): libuuid-2.23.2-65.el7_9.1.x86_64.rpm             |  84 kB   00:00     
(90/176): libxml2-2.9.1-6.el7_9.6.x86_64.rpm               | 668 kB   00:00     
(91/176): lua-5.1.4-15.el7.x86_64.rpm                      | 201 kB   00:00     
(92/176): lz4-1.8.3-1.el7.x86_64.rpm                       |  85 kB   00:00     
(93/176): make-3.82-24.el7.x86_64.rpm                      | 421 kB   00:00     
(94/176): mpfr-3.1.1-4.el7.x86_64.rpm                      | 203 kB   00:00     
(95/176): ncurses-5.9-14.20130511.el7_4.x86_64.rpm         | 304 kB   00:00     
(96/176): ncurses-base-5.9-14.20130511.el7_4.noarch.rpm    |  68 kB   00:00     
(97/176): ncurses-libs-5.9-14.20130511.el7_4.x86_64.rpm    | 316 kB   00:00     
(98/176): nspr-4.35.0-1.el7_9.x86_64.rpm                   | 128 kB   00:00     
(99/176): nss-3.90.0-2.el7_9.x86_64.rpm                    | 905 kB   00:00     
(100/176): nss-softokn-3.90.0-6.el7_9.x86_64.rpm           | 384 kB   00:00     
(101/176): nss-pem-1.0.3-7.el7_9.1.x86_64.rpm              |  75 kB   00:00     
(102/176): nss-softokn-freebl-3.90.0-6.el7_9.x86_64.rpm    | 321 kB   00:00     
(103/176): nss-sysinit-3.90.0-2.el7_9.x86_64.rpm           |  67 kB   00:00     
(104/176): nss-tools-3.90.0-2.el7_9.x86_64.rpm             | 557 kB   00:00     
(105/176): nss-util-3.90.0-1.el7_9.x86_64.rpm              |  80 kB   00:00     
(106/176): openldap-2.4.44-25.el7_9.x86_64.rpm             | 356 kB   00:00     
(107/176): openssl-libs-1.0.2k-26.el7_9.x86_64.rpm         | 1.2 MB   00:00     
(108/176): p11-kit-0.23.5-3.el7.x86_64.rpm                 | 252 kB   00:00     
(109/176): p11-kit-trust-0.23.5-3.el7.x86_64.rpm           | 129 kB   00:00     
(110/176): pam-1.1.8-23.el7.x86_64.rpm                     | 721 kB   00:00     
(111/176): patch-2.7.1-12.el7_7.x86_64.rpm                 | 111 kB   00:00     
(112/176): pcre-8.32-17.el7.x86_64.rpm                     | 422 kB   00:00     
(113/176): perl-Carp-1.26-244.el7.noarch.rpm               |  19 kB   00:00     
(114/176): perl-5.16.3-299.el7_9.x86_64.rpm                | 8.0 MB   00:00     
(115/176): perl-Encode-2.51-7.el7.x86_64.rpm               | 1.5 MB   00:00     
(116/176): perl-Exporter-5.68-3.el7.noarch.rpm             |  28 kB   00:00     
(117/176): perl-File-Path-2.09-2.el7.noarch.rpm            |  27 kB   00:00     
(118/176): perl-File-Temp-0.23.01-3.el7.noarch.rpm         |  56 kB   00:00     
(119/176): perl-Filter-1.49-3.el7.x86_64.rpm               |  76 kB   00:00     
(120/176): perl-Getopt-Long-2.40-3.el7.noarch.rpm          |  56 kB   00:00     
(121/176): perl-HTTP-Tiny-0.033-3.el7.noarch.rpm           |  38 kB   00:00     
(122/176): perl-PathTools-3.40-5.el7.x86_64.rpm            |  83 kB   00:00     
(123/176): perl-Pod-Escapes-1.04-299.el7_9.noarch.rpm      |  52 kB   00:00     
(124/176): perl-Pod-Perldoc-3.20-4.el7.noarch.rpm          |  87 kB   00:00     
(125/176): perl-Pod-Simple-3.28-4.el7.noarch.rpm           | 216 kB   00:00     
(126/176): perl-Pod-Usage-1.63-3.el7.noarch.rpm            |  27 kB   00:00     
(127/176): perl-Scalar-List-Utils-1.27-248.el7.x86_64.rpm  |  36 kB   00:00     
(128/176): perl-Socket-2.010-5.el7.x86_64.rpm              |  49 kB   00:00     
(129/176): perl-Text-ParseWords-3.29-4.el7.noarch.rpm      |  14 kB   00:00     
(130/176): perl-Storable-2.45-3.el7.x86_64.rpm             |  77 kB   00:00     
(131/176): perl-Thread-Queue-3.02-2.el7.noarch.rpm         |  17 kB   00:00     
(132/176): perl-Time-HiRes-1.9725-3.el7.x86_64.rpm         |  45 kB   00:00     
(133/176): perl-Time-Local-1.2300-2.el7.noarch.rpm         |  24 kB   00:00     
(134/176): perl-constant-1.27-2.el7.noarch.rpm             |  19 kB   00:00     
(135/176): perl-libs-5.16.3-299.el7_9.x86_64.rpm           | 690 kB   00:00     
(136/176): perl-macros-5.16.3-299.el7_9.x86_64.rpm         |  44 kB   00:00     
(137/176): perl-parent-0.225-244.el7.noarch.rpm            |  12 kB   00:00     
(138/176): perl-podlators-2.5.1-3.el7.noarch.rpm           | 112 kB   00:00     
(139/176): perl-srpm-macros-1-8.el7.noarch.rpm             | 4.7 kB   00:00     
(140/176): perl-threads-1.87-4.el7.x86_64.rpm              |  49 kB   00:00     
(141/176): perl-threads-shared-1.43-6.el7.x86_64.rpm       |  39 kB   00:00     
(142/176): pinentry-0.8.1-17.el7.x86_64.rpm                |  73 kB   00:00     
(143/176): pkgconfig-0.27.1-4.el7.x86_64.rpm               |  54 kB   00:00     
(144/176): popt-1.13-16.el7.x86_64.rpm                     |  42 kB   00:00     
(145/176): procps-ng-3.3.10-28.el7.x86_64.rpm              | 291 kB   00:00     
(146/176): pth-2.0.7-23.el7.x86_64.rpm                     |  89 kB   00:00     
(147/176): python-rpm-macros-3-34.el7.noarch.rpm           | 9.1 kB   00:00     
(148/176): python-srpm-macros-3-34.el7.noarch.rpm          | 8.8 kB   00:00     
(149/176): python-libs-2.7.5-94.el7_9.x86_64.rpm           | 5.6 MB   00:00     
(150/176): python2-rpm-macros-3-34.el7.noarch.rpm          | 8.1 kB   00:00     
(151/176): qrencode-libs-3.4.1-3.el7.x86_64.rpm            |  50 kB   00:00     
(152/176): readline-6.2-11.el7.x86_64.rpm                  | 193 kB   00:00     
(153/176): redhat-release-server-7.9-12.el7_9.x86_64.rpm   |  32 kB   00:00     
(154/176): redhat-rpm-config-9.1.0-88.el7.noarch.rpm       |  81 kB   00:00     
(155/176): rpm-4.11.3-48.el7_9.x86_64.rpm                  | 1.2 MB   00:00     
(156/176): rpm-build-4.11.3-48.el7_9.x86_64.rpm            | 150 kB   00:00     
(157/176): rpm-build-libs-4.11.3-48.el7_9.x86_64.rpm       | 108 kB   00:00     
(158/176): rpm-libs-4.11.3-48.el7_9.x86_64.rpm             | 279 kB   00:00     
(159/176): sed-4.2.2-7.el7.x86_64.rpm                      | 231 kB   00:00     
(160/176): setup-2.8.71-11.el7.noarch.rpm                  | 166 kB   00:00     
(161/176): shadow-utils-4.6-5.el7.x86_64.rpm               | 1.2 MB   00:00     
(162/176): shared-mime-info-1.8-5.el7.x86_64.rpm           | 312 kB   00:00     
(163/176): systemd-libs-219-78.el7_9.9.x86_64.rpm          | 419 kB   00:00     
(164/176): systemd-219-78.el7_9.9.x86_64.rpm               | 5.1 MB   00:00     
(165/176): sqlite-libs-3.34.0-1.vdb.1.el7.x86_64.rpm       | 592 kB   00:00     
(166/176): tar-1.26-35.el7.x86_64.rpm                      | 846 kB   00:00     
(167/176): tzdata-2024a-1.el7.noarch.rpm                   | 497 kB   00:00     
(168/176): unzip-6.0-24.el7_9.x86_64.rpm                   | 173 kB   00:00     
(169/176): ustr-1.0.4-16.el7.x86_64.rpm                    |  92 kB   00:00     
(170/176): util-linux-2.23.2-65.el7_9.1.x86_64.rpm         | 2.0 MB   00:00     
(171/176): which-2.20-7.el7.x86_64.rpm                     |  41 kB   00:00     
(172/176): xz-5.2.2-2.el7_9.x86_64.rpm                     | 229 kB   00:00     
(173/176): xz-libs-5.2.2-2.el7_9.x86_64.rpm                | 103 kB   00:00     
(174/176): zlib-1.2.7-21.el7_9.x86_64.rpm                  |  90 kB   00:00     
(175/176): zip-3.0-11.el7.x86_64.rpm                       | 260 kB   00:00     
(176/176): epel-rpm-macros-7-23.noarch.rpm                 |  15 kB   00:00     
--------------------------------------------------------------------------------
Total                                              9.3 MB/s | 132 MB  00:14     
Retrieving key from file:///usr/share/distribution-gpg-keys/redhat/RPM-GPG-KEY-redhat7-release
Importing GPG key 0xFD431D51:
 Userid     : "Red Hat, Inc. (release key 2) <security@redhat.com>"
 Fingerprint: 567e 347a d004 4ade 55ba 8a5f 199e 2f91 fd43 1d51
 From       : /usr/share/distribution-gpg-keys/redhat/RPM-GPG-KEY-redhat7-release
Importing GPG key 0x2FA658E0:
 Userid     : "Red Hat, Inc. (auxiliary key) <security@redhat.com>"
 Fingerprint: 43a6 e49c 4a38 f4be 9abf 2a53 4568 9c88 2fa6 58e0
 From       : /usr/share/distribution-gpg-keys/redhat/RPM-GPG-KEY-redhat7-release
Retrieving key from file:///usr/share/distribution-gpg-keys/epel/RPM-GPG-KEY-EPEL-7
Importing GPG key 0x352C64E5:
 Userid     : "Fedora EPEL (7) <epel@fedoraproject.org>"
 Fingerprint: 91e9 7d7c 4a5e 96f1 7f3e 888f 6a2f aea2 352c 64e5
 From       : /usr/share/distribution-gpg-keys/epel/RPM-GPG-KEY-EPEL-7
Running transaction check
Running transaction test
Transaction test succeeded
Running transaction
  Installing : libgcc-4.8.5-44.el7.x86_64                                 1/176 
  Installing : redhat-release-server-7.9-12.el7_9.x86_64                  2/176 
  Installing : setup-2.8.71-11.el7.noarch                                 3/176 
warning: /etc/hosts created as /etc/hosts.rpmnew
  Installing : filesystem-3.2-25.el7.x86_64                               4/176 
  Installing : python-srpm-macros-3-34.el7.noarch                         5/176 
  Installing : python-rpm-macros-3-34.el7.noarch                          6/176 
  Installing : basesystem-10.0-7.el7.noarch                               7/176 
  Installing : ncurses-base-5.9-14.20130511.el7_4.noarch                  8/176 
  Installing : perl-srpm-macros-1-8.el7.noarch                            9/176 
  Installing : kernel-headers-3.10.0-1160.119.1.el7.x86_64               10/176 
  Installing : tzdata-2024a-1.el7.noarch                                 11/176 
  Installing : nss-softokn-freebl-3.90.0-6.el7_9.x86_64                  12/176 
  Installing : glibc-common-2.17-326.el7_9.3.x86_64                      13/176 
  Installing : glibc-2.17-326.el7_9.3.x86_64                             14/176 
  Installing : nspr-4.35.0-1.el7_9.x86_64                                15/176 
  Installing : nss-util-3.90.0-1.el7_9.x86_64                            16/176 
  Installing : libstdc++-4.8.5-44.el7.x86_64                             17/176 
  Installing : ncurses-libs-5.9-14.20130511.el7_4.x86_64                 18/176 
  Installing : bash-4.2.46-35.el7_9.x86_64                               19/176 
  Installing : libsepol-2.5-10.el7.x86_64                                20/176 
  Installing : pcre-8.32-17.el7.x86_64                                   21/176 
  Installing : libselinux-2.5-15.el7.x86_64                              22/176 
  Installing : zlib-1.2.7-21.el7_9.x86_64                                23/176 
  Installing : info-5.1-5.el7.x86_64                                     24/176 
  Installing : bzip2-libs-1.0.6-13.el7.x86_64                            25/176 
  Installing : xz-libs-5.2.2-2.el7_9.x86_64                              26/176 
  Installing : elfutils-libelf-0.176-5.el7.x86_64                        27/176 
  Installing : libdb-5.3.21-25.el7.x86_64                                28/176 
  Installing : sed-4.2.2-7.el7.x86_64                                    29/176 
  Installing : 1:gmp-6.0.0-15.el7.x86_64                                 30/176 
  Installing : popt-1.13-16.el7.x86_64                                   31/176 
  Installing : libattr-2.4.46-13.el7.x86_64                              32/176 
  Installing : libacl-2.2.51-15.el7.x86_64                               33/176 
  Installing : libcap-2.22-11.el7.x86_64                                 34/176 
  Installing : libgpg-error-1.12-3.el7.x86_64                            35/176 
  Installing : libgcrypt-1.5.3-14.el7.x86_64                             36/176 
  Installing : chkconfig-1.7.6-1.el7.x86_64                              37/176 
  Installing : mpfr-3.1.1-4.el7.x86_64                                   38/176 
  Installing : readline-6.2-11.el7.x86_64                                39/176 
  Installing : lua-5.1.4-15.el7.x86_64                                   40/176 
  Installing : grep-2.20-3.el7.x86_64                                    41/176 
  Installing : libffi-3.0.13-19.el7.x86_64                               42/176 
  Installing : libuuid-2.23.2-65.el7_9.1.x86_64                          43/176 
  Installing : libcom_err-1.42.9-19.el7.x86_64                           44/176 
  Installing : libmpc-1.0.1-3.el7.x86_64                                 45/176 
  Installing : xz-5.2.2-2.el7_9.x86_64                                   46/176 
  Installing : gawk-4.0.2-4.el7_3.1.x86_64                               47/176 
  Installing : 1:findutils-4.5.11-6.el7.x86_64                           48/176 
  Installing : diffutils-3.3-6.el7_9.x86_64                              49/176 
  Installing : cpio-2.11-28.el7.x86_64                                   50/176 
  Installing : file-libs-5.11-37.el7.x86_64                              51/176 
  Installing : expat-2.1.0-15.el7_9.x86_64                               52/176 
  Installing : libcap-ng-0.7.5-4.el7.x86_64                              53/176 
  Installing : audit-libs-2.8.5-4.el7.x86_64                             54/176 
  Installing : p11-kit-0.23.5-3.el7.x86_64                               55/176 
  Installing : 2:tar-1.26-35.el7.x86_64                                  56/176 
  Installing : sqlite-libs-3.34.0-1.vdb.1.el7.x86_64                     57/176 
  Installing : nss-softokn-3.90.0-6.el7_9.x86_64                         58/176 
  Installing : gdbm-1.10-8.el7.x86_64                                    59/176 
  Installing : lz4-1.8.3-1.el7.x86_64                                    60/176 
  Installing : file-5.11-37.el7.x86_64                                   61/176 
  Installing : cpp-4.8.5-44.el7.x86_64                                   62/176 
  Installing : pinentry-0.8.1-17.el7.x86_64                              63/176 
  Installing : libassuan-2.1.0-3.el7.x86_64                              64/176 
  Installing : acl-2.2.51-15.el7.x86_64                                  65/176 
  Installing : patch-2.7.1-12.el7_7.x86_64                               66/176 
  Installing : groff-base-1.22.2-8.el7.x86_64                            67/176 
  Installing : 1:perl-parent-0.225-244.el7.noarch                        68/176 
  Installing : perl-HTTP-Tiny-0.033-3.el7.noarch                         69/176 
  Installing : perl-podlators-2.5.1-3.el7.noarch                         70/176 
  Installing : perl-Pod-Perldoc-3.20-4.el7.noarch                        71/176 
  Installing : 1:perl-Pod-Escapes-1.04-299.el7_9.noarch                  72/176 
  Installing : perl-Text-ParseWords-3.29-4.el7.noarch                    73/176 
  Installing : perl-Encode-2.51-7.el7.x86_64                             74/176 
  Installing : perl-Pod-Usage-1.63-3.el7.noarch                          75/176 
  Installing : 4:perl-Time-HiRes-1.9725-3.el7.x86_64                     76/176 
  Installing : perl-threads-1.87-4.el7.x86_64                            77/176 
  Installing : perl-Storable-2.45-3.el7.x86_64                           78/176 
  Installing : perl-Carp-1.26-244.el7.noarch                             79/176 
  Installing : perl-Filter-1.49-3.el7.x86_64                             80/176 
  Installing : perl-Exporter-5.68-3.el7.noarch                           81/176 
  Installing : perl-constant-1.27-2.el7.noarch                           82/176 
  Installing : perl-Socket-2.010-5.el7.x86_64                            83/176 
  Installing : 4:perl-macros-5.16.3-299.el7_9.x86_64                     84/176 
  Installing : perl-Time-Local-1.2300-2.el7.noarch                       85/176 
  Installing : perl-File-Path-2.09-2.el7.noarch                          86/176 
  Installing : perl-File-Temp-0.23.01-3.el7.noarch                       87/176 
  Installing : perl-PathTools-3.40-5.el7.x86_64                          88/176 
  Installing : perl-threads-shared-1.43-6.el7.x86_64                     89/176 
  Installing : perl-Scalar-List-Utils-1.27-248.el7.x86_64                90/176 
  Installing : 4:perl-libs-5.16.3-299.el7_9.x86_64                       91/176 
  Installing : 1:perl-Pod-Simple-3.28-4.el7.noarch                       92/176 
  Installing : perl-Getopt-Long-2.40-3.el7.noarch                        93/176 
  Installing : 4:perl-5.16.3-299.el7_9.x86_64                            94/176 
  Installing : perl-Thread-Queue-3.02-2.el7.noarch                       95/176 
  Installing : libdb-utils-5.3.21-25.el7.x86_64                          96/176 
  Installing : dwz-0.11-3.el7.x86_64                                     97/176 
  Installing : kmod-libs-20-28.el7.x86_64                                98/176 
  Installing : libxml2-2.9.1-6.el7_9.6.x86_64                            99/176 
  Installing : bzip2-1.0.6-13.el7.x86_64                                100/176 
  Installing : unzip-6.0-24.el7_9.x86_64                                101/176 
  Installing : zip-3.0-11.el7.x86_64                                    102/176 
  Installing : libidn-1.28-4.el7.x86_64                                 103/176 
  Installing : libgomp-4.8.5-44.el7.x86_64                              104/176 
  Installing : glibc-headers-2.17-326.el7_9.3.x86_64                    105/176 
  Installing : glibc-devel-2.17-326.el7_9.3.x86_64                      106/176 
  Installing : ncurses-5.9-14.20130511.el7_4.x86_64                     107/176 
  Installing : libstdc++-devel-4.8.5-44.el7.x86_64                      108/176 
  Installing : pth-2.0.7-23.el7.x86_64                                  109/176 
  Installing : libsmartcols-2.23.2-65.el7_9.1.x86_64                    110/176 
  Installing : ustr-1.0.4-16.el7.x86_64                                 111/176 
  Installing : libsemanage-2.5-14.el7.x86_64                            112/176 
  Installing : libverto-0.2.5-4.el7.x86_64                              113/176 
  Installing : libtasn1-4.10-1.el7.x86_64                               114/176 
  Installing : p11-kit-trust-0.23.5-3.el7.x86_64                        115/176 
  Installing : ca-certificates-2023.2.60_v7.0.306-72.el7_9.noarch       116/176 
  Installing : 1:hardlink-1.0-19.el7.x86_64                             117/176 
  Installing : qrencode-libs-3.4.1-3.el7.x86_64                         118/176 
  Installing : keyutils-libs-1.5.8-3.el7.x86_64                         119/176 
  Installing : 1:openssl-libs-1.0.2k-26.el7_9.x86_64                    120/176 
  Installing : coreutils-8.22-24.el7_9.2.x86_64                         121/176 
  Installing : krb5-libs-1.15.1-55.el7_9.x86_64                         122/176 
  Installing : libblkid-2.23.2-65.el7_9.1.x86_64                        123/176 
  Installing : gzip-1.5-11.el7_9.x86_64                                 124/176 
  Installing : cracklib-2.9.0-11.el7.x86_64                             125/176 
  Installing : libmount-2.23.2-65.el7_9.1.x86_64                        126/176 
  Installing : glib2-2.56.1-9.el7_9.x86_64                              127/176 
  Installing : shared-mime-info-1.8-5.el7.x86_64                        128/176 
  Installing : binutils-2.27-44.base.el7_9.1.x86_64                     129/176 
  Installing : 2:shadow-utils-4.6-5.el7.x86_64                          130/176 
  Installing : 1:pkgconfig-0.27.1-4.el7.x86_64                          131/176 
  Installing : cracklib-dicts-2.9.0-11.el7.x86_64                       132/176 
  Installing : pam-1.1.8-23.el7.x86_64                                  133/176 
  Installing : libpwquality-1.2.3-5.el7.x86_64                          134/176 
  Installing : libutempter-1.1.6-4.el7.x86_64                           135/176 
  Installing : gcc-4.8.5-44.el7.x86_64                                  136/176 
  Installing : cyrus-sasl-lib-2.1.26-24.el7_9.x86_64                    137/176 
  Installing : nss-pem-1.0.3-7.el7_9.1.x86_64                           138/176 
  Installing : nss-3.90.0-2.el7_9.x86_64                                139/176 
  Installing : nss-sysinit-3.90.0-2.el7_9.x86_64                        140/176 
  Installing : nss-tools-3.90.0-2.el7_9.x86_64                          141/176 
  Installing : python-libs-2.7.5-94.el7_9.x86_64                        142/176 
  Installing : gdb-7.6.1-120.el7.x86_64                                 143/176 
  Installing : libssh2-1.8.0-4.el7_9.1.x86_64                           144/176 
  Installing : libcurl-7.29.0-59.el7_9.2.x86_64                         145/176 
  Installing : curl-7.29.0-59.el7_9.2.x86_64                            146/176 
  Installing : rpm-libs-4.11.3-48.el7_9.x86_64                          147/176 
  Installing : rpm-4.11.3-48.el7_9.x86_64                               148/176 
  Installing : openldap-2.4.44-25.el7_9.x86_64                          149/176 
  Installing : libuser-0.60-9.el7.x86_64                                150/176 
  Installing : gnupg2-2.0.22-5.el7_5.x86_64                             151/176 
  Installing : rpm-build-libs-4.11.3-48.el7_9.x86_64                    152/176 
  Installing : redhat-rpm-config-9.1.0-88.el7.noarch                    153/176 
  Installing : json-c-0.11-4.el7_0.x86_64                               154/176 
  Installing : util-linux-2.23.2-65.el7_9.1.x86_64                      155/176 
  Installing : procps-ng-3.3.10-28.el7.x86_64                           156/176 
  Installing : 7:device-mapper-1.02.170-6.el7_9.5.x86_64                157/176 
  Installing : kpartx-0.4.9-136.el7_9.x86_64                            158/176 
  Installing : 7:device-mapper-libs-1.02.170-6.el7_9.5.x86_64           159/176 
  Installing : cryptsetup-libs-2.0.3-6.el7.x86_64                       160/176 
  Installing : dracut-033-572.el7.x86_64                                161/176 
  Installing : kmod-20-28.el7.x86_64                                    162/176 
  Installing : elfutils-libs-0.176-5.el7.x86_64                         163/176 
  Installing : systemd-libs-219-78.el7_9.9.x86_64                       164/176 
  Installing : 1:dbus-libs-1.10.24-15.el7.x86_64                        165/176 
  Installing : systemd-219-78.el7_9.9.x86_64                            166/176 
Running in chroot, ignoring request.
  Installing : 1:dbus-1.10.24-15.el7.x86_64                             167/176 
  Installing : elfutils-default-yama-scope-0.176-5.el7.noarch           168/176 
  Installing : elfutils-0.176-5.el7.x86_64                              169/176 
  Installing : python2-rpm-macros-3-34.el7.noarch                       170/176 
  Installing : epel-rpm-macros-7-23.noarch                              171/176 
  Installing : rpm-build-4.11.3-48.el7_9.x86_64                         172/176 
  Installing : gcc-c++-4.8.5-44.el7.x86_64                              173/176 
  Installing : which-2.20-7.el7.x86_64                                  174/176 
  Installing : 1:make-3.82-24.el7.x86_64                                175/176 
  Installing : epel-release-7-12.noarch                                 176/176 
  Verifying  : perl-HTTP-Tiny-0.033-3.el7.noarch                          1/176 
  Verifying  : gcc-c++-4.8.5-44.el7.x86_64                                2/176 
  Verifying  : acl-2.2.51-15.el7.x86_64                                   3/176 
  Verifying  : libblkid-2.23.2-65.el7_9.1.x86_64                          4/176 
  Verifying  : 1:pkgconfig-0.27.1-4.el7.x86_64                            5/176 
  Verifying  : libacl-2.2.51-15.el7.x86_64                                6/176 
  Verifying  : libcurl-7.29.0-59.el7_9.2.x86_64                           7/176 
  Verifying  : libdb-utils-5.3.21-25.el7.x86_64                           8/176 
  Verifying  : libcap-2.22-11.el7.x86_64                                  9/176 
  Verifying  : pcre-8.32-17.el7.x86_64                                   10/176 
  Verifying  : pth-2.0.7-23.el7.x86_64                                   11/176 
  Verifying  : readline-6.2-11.el7.x86_64                                12/176 
  Verifying  : which-2.20-7.el7.x86_64                                   13/176 
  Verifying  : groff-base-1.22.2-8.el7.x86_64                            14/176 
  Verifying  : cpp-4.8.5-44.el7.x86_64                                   15/176 
  Verifying  : libsmartcols-2.23.2-65.el7_9.1.x86_64                     16/176 
  Verifying  : shared-mime-info-1.8-5.el7.x86_64                         17/176 
  Verifying  : glibc-common-2.17-326.el7_9.3.x86_64                      18/176 
  Verifying  : 1:dbus-1.10.24-15.el7.x86_64                              19/176 
  Verifying  : libselinux-2.5-15.el7.x86_64                              20/176 
  Verifying  : util-linux-2.23.2-65.el7_9.1.x86_64                       21/176 
  Verifying  : libsemanage-2.5-14.el7.x86_64                             22/176 
  Verifying  : kmod-libs-20-28.el7.x86_64                                23/176 
  Verifying  : procps-ng-3.3.10-28.el7.x86_64                            24/176 
  Verifying  : openldap-2.4.44-25.el7_9.x86_64                           25/176 
  Verifying  : python2-rpm-macros-3-34.el7.noarch                        26/176 
  Verifying  : cracklib-dicts-2.9.0-11.el7.x86_64                        27/176 
  Verifying  : perl-File-Path-2.09-2.el7.noarch                          28/176 
  Verifying  : libstdc++-4.8.5-44.el7.x86_64                             29/176 
  Verifying  : epel-release-7-12.noarch                                  30/176 
  Verifying  : libassuan-2.1.0-3.el7.x86_64                              31/176 
  Verifying  : 7:device-mapper-1.02.170-6.el7_9.5.x86_64                 32/176 
  Verifying  : perl-Text-ParseWords-3.29-4.el7.noarch                    33/176 
  Verifying  : python-srpm-macros-3-34.el7.noarch                        34/176 
  Verifying  : ustr-1.0.4-16.el7.x86_64                                  35/176 
  Verifying  : lua-5.1.4-15.el7.x86_64                                   36/176 
  Verifying  : libgcc-4.8.5-44.el7.x86_64                                37/176 
  Verifying  : libutempter-1.1.6-4.el7.x86_64                            38/176 
  Verifying  : file-5.11-37.el7.x86_64                                   39/176 
  Verifying  : libidn-1.28-4.el7.x86_64                                  40/176 
  Verifying  : libxml2-2.9.1-6.el7_9.6.x86_64                            41/176 
  Verifying  : setup-2.8.71-11.el7.noarch                                42/176 
  Verifying  : 4:perl-Time-HiRes-1.9725-3.el7.x86_64                     43/176 
  Verifying  : ncurses-libs-5.9-14.20130511.el7_4.x86_64                 44/176 
  Verifying  : chkconfig-1.7.6-1.el7.x86_64                              45/176 
  Verifying  : pam-1.1.8-23.el7.x86_64                                   46/176 
  Verifying  : elfutils-default-yama-scope-0.176-5.el7.noarch            47/176 
  Verifying  : libmount-2.23.2-65.el7_9.1.x86_64                         48/176 
  Verifying  : dracut-033-572.el7.x86_64                                 49/176 
  Verifying  : 1:dbus-libs-1.10.24-15.el7.x86_64                         50/176 
  Verifying  : zlib-1.2.7-21.el7_9.x86_64                                51/176 
  Verifying  : cryptsetup-libs-2.0.3-6.el7.x86_64                        52/176 
  Verifying  : tzdata-2024a-1.el7.noarch                                 53/176 
  Verifying  : libssh2-1.8.0-4.el7_9.1.x86_64                            54/176 
  Verifying  : bzip2-1.0.6-13.el7.x86_64                                 55/176 
  Verifying  : 1:openssl-libs-1.0.2k-26.el7_9.x86_64                     56/176 
  Verifying  : libverto-0.2.5-4.el7.x86_64                               57/176 
  Verifying  : gdb-7.6.1-120.el7.x86_64                                  58/176 
  Verifying  : nss-pem-1.0.3-7.el7_9.1.x86_64                            59/176 
  Verifying  : 1:make-3.82-24.el7.x86_64                                 60/176 
  Verifying  : info-5.1-5.el7.x86_64                                     61/176 
  Verifying  : binutils-2.27-44.base.el7_9.1.x86_64                      62/176 
  Verifying  : epel-rpm-macros-7-23.noarch                               63/176 
  Verifying  : bzip2-libs-1.0.6-13.el7.x86_64                            64/176 
  Verifying  : 1:perl-parent-0.225-244.el7.noarch                        65/176 
  Verifying  : libsepol-2.5-10.el7.x86_64                                66/176 
  Verifying  : bash-4.2.46-35.el7_9.x86_64                               67/176 
  Verifying  : libmpc-1.0.1-3.el7.x86_64                                 68/176 
  Verifying  : nss-tools-3.90.0-2.el7_9.x86_64                           69/176 
  Verifying  : systemd-219-78.el7_9.9.x86_64                             70/176 
  Verifying  : perl-Pod-Usage-1.63-3.el7.noarch                          71/176 
  Verifying  : perl-Encode-2.51-7.el7.x86_64                             72/176 
  Verifying  : libuser-0.60-9.el7.x86_64                                 73/176 
  Verifying  : libtasn1-4.10-1.el7.x86_64                                74/176 
  Verifying  : perl-threads-1.87-4.el7.x86_64                            75/176 
  Verifying  : 1:hardlink-1.0-19.el7.x86_64                              76/176 
  Verifying  : cracklib-2.9.0-11.el7.x86_64                              77/176 
  Verifying  : nss-sysinit-3.90.0-2.el7_9.x86_64                         78/176 
  Verifying  : perl-Getopt-Long-2.40-3.el7.noarch                        79/176 
  Verifying  : kernel-headers-3.10.0-1160.119.1.el7.x86_64               80/176 
  Verifying  : cyrus-sasl-lib-2.1.26-24.el7_9.x86_64                     81/176 
  Verifying  : libgomp-4.8.5-44.el7.x86_64                               82/176 
  Verifying  : gnupg2-2.0.22-5.el7_5.x86_64                              83/176 
  Verifying  : nss-softokn-3.90.0-6.el7_9.x86_64                         84/176 
  Verifying  : glibc-headers-2.17-326.el7_9.3.x86_64                     85/176 
  Verifying  : popt-1.13-16.el7.x86_64                                   86/176 
  Verifying  : libffi-3.0.13-19.el7.x86_64                               87/176 
  Verifying  : p11-kit-0.23.5-3.el7.x86_64                               88/176 
  Verifying  : 2:shadow-utils-4.6-5.el7.x86_64                           89/176 
  Verifying  : perl-Storable-2.45-3.el7.x86_64                           90/176 
  Verifying  : unzip-6.0-24.el7_9.x86_64                                 91/176 
  Verifying  : perl-File-Temp-0.23.01-3.el7.noarch                       92/176 
  Verifying  : 7:device-mapper-libs-1.02.170-6.el7_9.5.x86_64            93/176 
  Verifying  : libattr-2.4.46-13.el7.x86_64                              94/176 
  Verifying  : gawk-4.0.2-4.el7_3.1.x86_64                               95/176 
  Verifying  : audit-libs-2.8.5-4.el7.x86_64                             96/176 
  Verifying  : perl-srpm-macros-1-8.el7.noarch                           97/176 
  Verifying  : qrencode-libs-3.4.1-3.el7.x86_64                          98/176 
  Verifying  : python-rpm-macros-3-34.el7.noarch                         99/176 
  Verifying  : 1:perl-Pod-Escapes-1.04-299.el7_9.noarch                 100/176 
  Verifying  : grep-2.20-3.el7.x86_64                                   101/176 
  Verifying  : xz-libs-5.2.2-2.el7_9.x86_64                             102/176 
  Verifying  : nss-softokn-freebl-3.90.0-6.el7_9.x86_64                 103/176 
  Verifying  : patch-2.7.1-12.el7_7.x86_64                              104/176 
  Verifying  : filesystem-3.2-25.el7.x86_64                             105/176 
  Verifying  : perl-Carp-1.26-244.el7.noarch                            106/176 
  Verifying  : libdb-5.3.21-25.el7.x86_64                               107/176 
  Verifying  : krb5-libs-1.15.1-55.el7_9.x86_64                         108/176 
  Verifying  : rpm-build-4.11.3-48.el7_9.x86_64                         109/176 
  Verifying  : file-libs-5.11-37.el7.x86_64                             110/176 
  Verifying  : glibc-2.17-326.el7_9.3.x86_64                            111/176 
  Verifying  : gdbm-1.10-8.el7.x86_64                                   112/176 
  Verifying  : gcc-4.8.5-44.el7.x86_64                                  113/176 
  Verifying  : coreutils-8.22-24.el7_9.2.x86_64                         114/176 
  Verifying  : elfutils-libelf-0.176-5.el7.x86_64                       115/176 
  Verifying  : 2:tar-1.26-35.el7.x86_64                                 116/176 
  Verifying  : rpm-libs-4.11.3-48.el7_9.x86_64                          117/176 
  Verifying  : systemd-libs-219-78.el7_9.9.x86_64                       118/176 
  Verifying  : 1:findutils-4.5.11-6.el7.x86_64                          119/176 
  Verifying  : nss-util-3.90.0-1.el7_9.x86_64                           120/176 
  Verifying  : ca-certificates-2023.2.60_v7.0.306-72.el7_9.noarch       121/176 
  Verifying  : perl-Pod-Perldoc-3.20-4.el7.noarch                       122/176 
  Verifying  : libuuid-2.23.2-65.el7_9.1.x86_64                         123/176 
  Verifying  : 4:perl-5.16.3-299.el7_9.x86_64                           124/176 
  Verifying  : glibc-devel-2.17-326.el7_9.3.x86_64                      125/176 
  Verifying  : mpfr-3.1.1-4.el7.x86_64                                  126/176 
  Verifying  : perl-Filter-1.49-3.el7.x86_64                            127/176 
  Verifying  : dwz-0.11-3.el7.x86_64                                    128/176 
  Verifying  : ncurses-5.9-14.20130511.el7_4.x86_64                     129/176 
  Verifying  : basesystem-10.0-7.el7.noarch                             130/176 
  Verifying  : ncurses-base-5.9-14.20130511.el7_4.noarch                131/176 
  Verifying  : diffutils-3.3-6.el7_9.x86_64                             132/176 
  Verifying  : sqlite-libs-3.34.0-1.vdb.1.el7.x86_64                    133/176 
  Verifying  : redhat-release-server-7.9-12.el7_9.x86_64                134/176 
  Verifying  : nss-3.90.0-2.el7_9.x86_64                                135/176 
  Verifying  : kpartx-0.4.9-136.el7_9.x86_64                            136/176 
  Verifying  : lz4-1.8.3-1.el7.x86_64                                   137/176 
  Verifying  : rpm-4.11.3-48.el7_9.x86_64                               138/176 
  Verifying  : perl-Exporter-5.68-3.el7.noarch                          139/176 
  Verifying  : perl-constant-1.27-2.el7.noarch                          140/176 
  Verifying  : perl-PathTools-3.40-5.el7.x86_64                         141/176 
  Verifying  : keyutils-libs-1.5.8-3.el7.x86_64                         142/176 
  Verifying  : pinentry-0.8.1-17.el7.x86_64                             143/176 
  Verifying  : perl-Socket-2.010-5.el7.x86_64                           144/176 
  Verifying  : 4:perl-macros-5.16.3-299.el7_9.x86_64                    145/176 
  Verifying  : glib2-2.56.1-9.el7_9.x86_64                              146/176 
  Verifying  : libgpg-error-1.12-3.el7.x86_64                           147/176 
  Verifying  : redhat-rpm-config-9.1.0-88.el7.noarch                    148/176 
  Verifying  : libcom_err-1.42.9-19.el7.x86_64                          149/176 
  Verifying  : perl-Thread-Queue-3.02-2.el7.noarch                      150/176 
  Verifying  : 1:perl-Pod-Simple-3.28-4.el7.noarch                      151/176 
  Verifying  : perl-Time-Local-1.2300-2.el7.noarch                      152/176 
  Verifying  : perl-threads-shared-1.43-6.el7.x86_64                    153/176 
  Verifying  : curl-7.29.0-59.el7_9.2.x86_64                            154/176 
  Verifying  : json-c-0.11-4.el7_0.x86_64                               155/176 
  Verifying  : expat-2.1.0-15.el7_9.x86_64                              156/176 
  Verifying  : libcap-ng-0.7.5-4.el7.x86_64                             157/176 
  Verifying  : 1:gmp-6.0.0-15.el7.x86_64                                158/176 
  Verifying  : perl-Scalar-List-Utils-1.27-248.el7.x86_64               159/176 
  Verifying  : p11-kit-trust-0.23.5-3.el7.x86_64                        160/176 
  Verifying  : sed-4.2.2-7.el7.x86_64                                   161/176 
  Verifying  : libgcrypt-1.5.3-14.el7.x86_64                            162/176 
  Verifying  : cpio-2.11-28.el7.x86_64                                  163/176 
  Verifying  : gzip-1.5-11.el7_9.x86_64                                 164/176 
  Verifying  : perl-podlators-2.5.1-3.el7.noarch                        165/176 
  Verifying  : elfutils-0.176-5.el7.x86_64                              166/176 
  Verifying  : zip-3.0-11.el7.x86_64                                    167/176 
  Verifying  : nspr-4.35.0-1.el7_9.x86_64                               168/176 
  Verifying  : python-libs-2.7.5-94.el7_9.x86_64                        169/176 
  Verifying  : libstdc++-devel-4.8.5-44.el7.x86_64                      170/176 
  Verifying  : libpwquality-1.2.3-5.el7.x86_64                          171/176 
  Verifying  : xz-5.2.2-2.el7_9.x86_64                                  172/176 
  Verifying  : 4:perl-libs-5.16.3-299.el7_9.x86_64                      173/176 
  Verifying  : rpm-build-libs-4.11.3-48.el7_9.x86_64                    174/176 
  Verifying  : elfutils-libs-0.176-5.el7.x86_64                         175/176 
  Verifying  : kmod-20-28.el7.x86_64                                    176/176 

Installed:
  bash.x86_64 0:4.2.46-35.el7_9             bzip2.x86_64 0:1.0.6-13.el7         
  coreutils.x86_64 0:8.22-24.el7_9.2        cpio.x86_64 0:2.11-28.el7           
  diffutils.x86_64 0:3.3-6.el7_9            epel-release.noarch 0:7-12          
  epel-rpm-macros.noarch 0:7-23             findutils.x86_64 1:4.5.11-6.el7     
  gawk.x86_64 0:4.0.2-4.el7_3.1             gcc.x86_64 0:4.8.5-44.el7           
  gcc-c++.x86_64 0:4.8.5-44.el7             grep.x86_64 0:2.20-3.el7            
  gzip.x86_64 0:1.5-11.el7_9                info.x86_64 0:5.1-5.el7             
  make.x86_64 1:3.82-24.el7                 patch.x86_64 0:2.7.1-12.el7_7       
  redhat-rpm-config.noarch 0:9.1.0-88.el7   rpm-build.x86_64 0:4.11.3-48.el7_9  
  sed.x86_64 0:4.2.2-7.el7                  shadow-utils.x86_64 2:4.6-5.el7     
  tar.x86_64 2:1.26-35.el7                  unzip.x86_64 0:6.0-24.el7_9         
  util-linux.x86_64 0:2.23.2-65.el7_9.1     which.x86_64 0:2.20-7.el7           
  xz.x86_64 0:5.2.2-2.el7_9                

Dependency Installed:
  acl.x86_64 0:2.2.51-15.el7                                                    
  audit-libs.x86_64 0:2.8.5-4.el7                                               
  basesystem.noarch 0:10.0-7.el7                                                
  binutils.x86_64 0:2.27-44.base.el7_9.1                                        
  bzip2-libs.x86_64 0:1.0.6-13.el7                                              
  ca-certificates.noarch 0:2023.2.60_v7.0.306-72.el7_9                          
  chkconfig.x86_64 0:1.7.6-1.el7                                                
  cpp.x86_64 0:4.8.5-44.el7                                                     
  cracklib.x86_64 0:2.9.0-11.el7                                                
  cracklib-dicts.x86_64 0:2.9.0-11.el7                                          
  cryptsetup-libs.x86_64 0:2.0.3-6.el7                                          
  curl.x86_64 0:7.29.0-59.el7_9.2                                               
  cyrus-sasl-lib.x86_64 0:2.1.26-24.el7_9                                       
  dbus.x86_64 1:1.10.24-15.el7                                                  
  dbus-libs.x86_64 1:1.10.24-15.el7                                             
  device-mapper.x86_64 7:1.02.170-6.el7_9.5                                     
  device-mapper-libs.x86_64 7:1.02.170-6.el7_9.5                                
  dracut.x86_64 0:033-572.el7                                                   
  dwz.x86_64 0:0.11-3.el7                                                       
  elfutils.x86_64 0:0.176-5.el7                                                 
  elfutils-default-yama-scope.noarch 0:0.176-5.el7                              
  elfutils-libelf.x86_64 0:0.176-5.el7                                          
  elfutils-libs.x86_64 0:0.176-5.el7                                            
  expat.x86_64 0:2.1.0-15.el7_9                                                 
  file.x86_64 0:5.11-37.el7                                                     
  file-libs.x86_64 0:5.11-37.el7                                                
  filesystem.x86_64 0:3.2-25.el7                                                
  gdb.x86_64 0:7.6.1-120.el7                                                    
  gdbm.x86_64 0:1.10-8.el7                                                      
  glib2.x86_64 0:2.56.1-9.el7_9                                                 
  glibc.x86_64 0:2.17-326.el7_9.3                                               
  glibc-common.x86_64 0:2.17-326.el7_9.3                                        
  glibc-devel.x86_64 0:2.17-326.el7_9.3                                         
  glibc-headers.x86_64 0:2.17-326.el7_9.3                                       
  gmp.x86_64 1:6.0.0-15.el7                                                     
  gnupg2.x86_64 0:2.0.22-5.el7_5                                                
  groff-base.x86_64 0:1.22.2-8.el7                                              
  hardlink.x86_64 1:1.0-19.el7                                                  
  json-c.x86_64 0:0.11-4.el7_0                                                  
  kernel-headers.x86_64 0:3.10.0-1160.119.1.el7                                 
  keyutils-libs.x86_64 0:1.5.8-3.el7                                            
  kmod.x86_64 0:20-28.el7                                                       
  kmod-libs.x86_64 0:20-28.el7                                                  
  kpartx.x86_64 0:0.4.9-136.el7_9                                               
  krb5-libs.x86_64 0:1.15.1-55.el7_9                                            
  libacl.x86_64 0:2.2.51-15.el7                                                 
  libassuan.x86_64 0:2.1.0-3.el7                                                
  libattr.x86_64 0:2.4.46-13.el7                                                
  libblkid.x86_64 0:2.23.2-65.el7_9.1                                           
  libcap.x86_64 0:2.22-11.el7                                                   
  libcap-ng.x86_64 0:0.7.5-4.el7                                                
  libcom_err.x86_64 0:1.42.9-19.el7                                             
  libcurl.x86_64 0:7.29.0-59.el7_9.2                                            
  libdb.x86_64 0:5.3.21-25.el7                                                  
  libdb-utils.x86_64 0:5.3.21-25.el7                                            
  libffi.x86_64 0:3.0.13-19.el7                                                 
  libgcc.x86_64 0:4.8.5-44.el7                                                  
  libgcrypt.x86_64 0:1.5.3-14.el7                                               
  libgomp.x86_64 0:4.8.5-44.el7                                                 
  libgpg-error.x86_64 0:1.12-3.el7                                              
  libidn.x86_64 0:1.28-4.el7                                                    
  libmount.x86_64 0:2.23.2-65.el7_9.1                                           
  libmpc.x86_64 0:1.0.1-3.el7                                                   
  libpwquality.x86_64 0:1.2.3-5.el7                                             
  libselinux.x86_64 0:2.5-15.el7                                                
  libsemanage.x86_64 0:2.5-14.el7                                               
  libsepol.x86_64 0:2.5-10.el7                                                  
  libsmartcols.x86_64 0:2.23.2-65.el7_9.1                                       
  libssh2.x86_64 0:1.8.0-4.el7_9.1                                              
  libstdc++.x86_64 0:4.8.5-44.el7                                               
  libstdc++-devel.x86_64 0:4.8.5-44.el7                                         
  libtasn1.x86_64 0:4.10-1.el7                                                  
  libuser.x86_64 0:0.60-9.el7                                                   
  libutempter.x86_64 0:1.1.6-4.el7                                              
  libuuid.x86_64 0:2.23.2-65.el7_9.1                                            
  libverto.x86_64 0:0.2.5-4.el7                                                 
  libxml2.x86_64 0:2.9.1-6.el7_9.6                                              
  lua.x86_64 0:5.1.4-15.el7                                                     
  lz4.x86_64 0:1.8.3-1.el7                                                      
  mpfr.x86_64 0:3.1.1-4.el7                                                     
  ncurses.x86_64 0:5.9-14.20130511.el7_4                                        
  ncurses-base.noarch 0:5.9-14.20130511.el7_4                                   
  ncurses-libs.x86_64 0:5.9-14.20130511.el7_4                                   
  nspr.x86_64 0:4.35.0-1.el7_9                                                  
  nss.x86_64 0:3.90.0-2.el7_9                                                   
  nss-pem.x86_64 0:1.0.3-7.el7_9.1                                              
  nss-softokn.x86_64 0:3.90.0-6.el7_9                                           
  nss-softokn-freebl.x86_64 0:3.90.0-6.el7_9                                    
  nss-sysinit.x86_64 0:3.90.0-2.el7_9                                           
  nss-tools.x86_64 0:3.90.0-2.el7_9                                             
  nss-util.x86_64 0:3.90.0-1.el7_9                                              
  openldap.x86_64 0:2.4.44-25.el7_9                                             
  openssl-libs.x86_64 1:1.0.2k-26.el7_9                                         
  p11-kit.x86_64 0:0.23.5-3.el7                                                 
  p11-kit-trust.x86_64 0:0.23.5-3.el7                                           
  pam.x86_64 0:1.1.8-23.el7                                                     
  pcre.x86_64 0:8.32-17.el7                                                     
  perl.x86_64 4:5.16.3-299.el7_9                                                
  perl-Carp.noarch 0:1.26-244.el7                                               
  perl-Encode.x86_64 0:2.51-7.el7                                               
  perl-Exporter.noarch 0:5.68-3.el7                                             
  perl-File-Path.noarch 0:2.09-2.el7                                            
  perl-File-Temp.noarch 0:0.23.01-3.el7                                         
  perl-Filter.x86_64 0:1.49-3.el7                                               
  perl-Getopt-Long.noarch 0:2.40-3.el7                                          
  perl-HTTP-Tiny.noarch 0:0.033-3.el7                                           
  perl-PathTools.x86_64 0:3.40-5.el7                                            
  perl-Pod-Escapes.noarch 1:1.04-299.el7_9                                      
  perl-Pod-Perldoc.noarch 0:3.20-4.el7                                          
  perl-Pod-Simple.noarch 1:3.28-4.el7                                           
  perl-Pod-Usage.noarch 0:1.63-3.el7                                            
  perl-Scalar-List-Utils.x86_64 0:1.27-248.el7                                  
  perl-Socket.x86_64 0:2.010-5.el7                                              
  perl-Storable.x86_64 0:2.45-3.el7                                             
  perl-Text-ParseWords.noarch 0:3.29-4.el7                                      
  perl-Thread-Queue.noarch 0:3.02-2.el7                                         
  perl-Time-HiRes.x86_64 4:1.9725-3.el7                                         
  perl-Time-Local.noarch 0:1.2300-2.el7                                         
  perl-constant.noarch 0:1.27-2.el7                                             
  perl-libs.x86_64 4:5.16.3-299.el7_9                                           
  perl-macros.x86_64 4:5.16.3-299.el7_9                                         
  perl-parent.noarch 1:0.225-244.el7                                            
  perl-podlators.noarch 0:2.5.1-3.el7                                           
  perl-srpm-macros.noarch 0:1-8.el7                                             
  perl-threads.x86_64 0:1.87-4.el7                                              
  perl-threads-shared.x86_64 0:1.43-6.el7                                       
  pinentry.x86_64 0:0.8.1-17.el7                                                
  pkgconfig.x86_64 1:0.27.1-4.el7                                               
  popt.x86_64 0:1.13-16.el7                                                     
  procps-ng.x86_64 0:3.3.10-28.el7                                              
  pth.x86_64 0:2.0.7-23.el7                                                     
  python-libs.x86_64 0:2.7.5-94.el7_9                                           
  python-rpm-macros.noarch 0:3-34.el7                                           
  python-srpm-macros.noarch 0:3-34.el7                                          
  python2-rpm-macros.noarch 0:3-34.el7                                          
  qrencode-libs.x86_64 0:3.4.1-3.el7                                            
  readline.x86_64 0:6.2-11.el7                                                  
  redhat-release-server.x86_64 0:7.9-12.el7_9                                   
  rpm.x86_64 0:4.11.3-48.el7_9                                                  
  rpm-build-libs.x86_64 0:4.11.3-48.el7_9                                       
  rpm-libs.x86_64 0:4.11.3-48.el7_9                                             
  setup.noarch 0:2.8.71-11.el7                                                  
  shared-mime-info.x86_64 0:1.8-5.el7                                           
  sqlite-libs.x86_64 0:3.34.0-1.vdb.1.el7                                       
  systemd.x86_64 0:219-78.el7_9.9                                               
  systemd-libs.x86_64 0:219-78.el7_9.9                                          
  tzdata.noarch 0:2024a-1.el7                                                   
  ustr.x86_64 0:1.0.4-16.el7                                                    
  xz-libs.x86_64 0:5.2.2-2.el7_9                                                
  zip.x86_64 0:3.0-11.el7                                                       
  zlib.x86_64 0:1.2.7-21.el7_9                                                  

Complete!
Finish: installing minimal buildroot with yum
Start: creating root cache
Finish: creating root cache
Finish: chroot init
INFO: Installed packages:
INFO: acl-2.2.51-15.el7.x86_64
audit-libs-2.8.5-4.el7.x86_64
basesystem-10.0-7.el7.noarch
bash-4.2.46-35.el7_9.x86_64
binutils-2.27-44.base.el7_9.1.x86_64
bzip2-1.0.6-13.el7.x86_64
bzip2-libs-1.0.6-13.el7.x86_64
ca-certificates-2023.2.60_v7.0.306-72.el7_9.noarch
chkconfig-1.7.6-1.el7.x86_64
coreutils-8.22-24.el7_9.2.x86_64
cpio-2.11-28.el7.x86_64
cpp-4.8.5-44.el7.x86_64
cracklib-2.9.0-11.el7.x86_64
cracklib-dicts-2.9.0-11.el7.x86_64
cryptsetup-libs-2.0.3-6.el7.x86_64
curl-7.29.0-59.el7_9.2.x86_64
cyrus-sasl-lib-2.1.26-24.el7_9.x86_64
dbus-1.10.24-15.el7.x86_64
dbus-libs-1.10.24-15.el7.x86_64
device-mapper-1.02.170-6.el7_9.5.x86_64
device-mapper-libs-1.02.170-6.el7_9.5.x86_64
diffutils-3.3-6.el7_9.x86_64
dracut-033-572.el7.x86_64
dwz-0.11-3.el7.x86_64
elfutils-0.176-5.el7.x86_64
elfutils-default-yama-scope-0.176-5.el7.noarch
elfutils-libelf-0.176-5.el7.x86_64
elfutils-libs-0.176-5.el7.x86_64
epel-release-7-12.noarch
epel-rpm-macros-7-23.noarch
expat-2.1.0-15.el7_9.x86_64
file-5.11-37.el7.x86_64
file-libs-5.11-37.el7.x86_64
filesystem-3.2-25.el7.x86_64
findutils-4.5.11-6.el7.x86_64
gawk-4.0.2-4.el7_3.1.x86_64
gcc-4.8.5-44.el7.x86_64
gcc-c++-4.8.5-44.el7.x86_64
gdb-7.6.1-120.el7.x86_64
gdbm-1.10-8.el7.x86_64
glib2-2.56.1-9.el7_9.x86_64
glibc-2.17-326.el7_9.3.x86_64
glibc-common-2.17-326.el7_9.3.x86_64
glibc-devel-2.17-326.el7_9.3.x86_64
glibc-headers-2.17-326.el7_9.3.x86_64
gmp-6.0.0-15.el7.x86_64
gnupg2-2.0.22-5.el7_5.x86_64
gpg-pubkey-2fa658e0-45700c69
gpg-pubkey-352c64e5-52ae6884
gpg-pubkey-fd431d51-4ae0493b
grep-2.20-3.el7.x86_64
groff-base-1.22.2-8.el7.x86_64
gzip-1.5-11.el7_9.x86_64
hardlink-1.0-19.el7.x86_64
info-5.1-5.el7.x86_64
json-c-0.11-4.el7_0.x86_64
kernel-headers-3.10.0-1160.119.1.el7.x86_64
keyutils-libs-1.5.8-3.el7.x86_64
kmod-20-28.el7.x86_64
kmod-libs-20-28.el7.x86_64
kpartx-0.4.9-136.el7_9.x86_64
krb5-libs-1.15.1-55.el7_9.x86_64
libacl-2.2.51-15.el7.x86_64
libassuan-2.1.0-3.el7.x86_64
libattr-2.4.46-13.el7.x86_64
libblkid-2.23.2-65.el7_9.1.x86_64
libcap-2.22-11.el7.x86_64
libcap-ng-0.7.5-4.el7.x86_64
libcom_err-1.42.9-19.el7.x86_64
libcurl-7.29.0-59.el7_9.2.x86_64
libdb-5.3.21-25.el7.x86_64
libdb-utils-5.3.21-25.el7.x86_64
libffi-3.0.13-19.el7.x86_64
libgcc-4.8.5-44.el7.x86_64
libgcrypt-1.5.3-14.el7.x86_64
libgomp-4.8.5-44.el7.x86_64
libgpg-error-1.12-3.el7.x86_64
libidn-1.28-4.el7.x86_64
libmount-2.23.2-65.el7_9.1.x86_64
libmpc-1.0.1-3.el7.x86_64
libpwquality-1.2.3-5.el7.x86_64
libselinux-2.5-15.el7.x86_64
libsemanage-2.5-14.el7.x86_64
libsepol-2.5-10.el7.x86_64
libsmartcols-2.23.2-65.el7_9.1.x86_64
libssh2-1.8.0-4.el7_9.1.x86_64
libstdc++-4.8.5-44.el7.x86_64
libstdc++-devel-4.8.5-44.el7.x86_64
libtasn1-4.10-1.el7.x86_64
libuser-0.60-9.el7.x86_64
libutempter-1.1.6-4.el7.x86_64
libuuid-2.23.2-65.el7_9.1.x86_64
libverto-0.2.5-4.el7.x86_64
libxml2-2.9.1-6.el7_9.6.x86_64
lua-5.1.4-15.el7.x86_64
lz4-1.8.3-1.el7.x86_64
make-3.82-24.el7.x86_64
mpfr-3.1.1-4.el7.x86_64
ncurses-5.9-14.20130511.el7_4.x86_64
ncurses-base-5.9-14.20130511.el7_4.noarch
ncurses-libs-5.9-14.20130511.el7_4.x86_64
nspr-4.35.0-1.el7_9.x86_64
nss-3.90.0-2.el7_9.x86_64
nss-pem-1.0.3-7.el7_9.1.x86_64
nss-softokn-3.90.0-6.el7_9.x86_64
nss-softokn-freebl-3.90.0-6.el7_9.x86_64
nss-sysinit-3.90.0-2.el7_9.x86_64
nss-tools-3.90.0-2.el7_9.x86_64
nss-util-3.90.0-1.el7_9.x86_64
openldap-2.4.44-25.el7_9.x86_64
openssl-libs-1.0.2k-26.el7_9.x86_64
p11-kit-0.23.5-3.el7.x86_64
p11-kit-trust-0.23.5-3.el7.x86_64
pam-1.1.8-23.el7.x86_64
patch-2.7.1-12.el7_7.x86_64
pcre-8.32-17.el7.x86_64
perl-5.16.3-299.el7_9.x86_64
perl-Carp-1.26-244.el7.noarch
perl-Encode-2.51-7.el7.x86_64
perl-Exporter-5.68-3.el7.noarch
perl-File-Path-2.09-2.el7.noarch
perl-File-Temp-0.23.01-3.el7.noarch
perl-Filter-1.49-3.el7.x86_64
perl-Getopt-Long-2.40-3.el7.noarch
perl-HTTP-Tiny-0.033-3.el7.noarch
perl-PathTools-3.40-5.el7.x86_64
perl-Pod-Escapes-1.04-299.el7_9.noarch
perl-Pod-Perldoc-3.20-4.el7.noarch
perl-Pod-Simple-3.28-4.el7.noarch
perl-Pod-Usage-1.63-3.el7.noarch
perl-Scalar-List-Utils-1.27-248.el7.x86_64
perl-Socket-2.010-5.el7.x86_64
perl-Storable-2.45-3.el7.x86_64
perl-Text-ParseWords-3.29-4.el7.noarch
perl-Thread-Queue-3.02-2.el7.noarch
perl-Time-HiRes-1.9725-3.el7.x86_64
perl-Time-Local-1.2300-2.el7.noarch
perl-constant-1.27-2.el7.noarch
perl-libs-5.16.3-299.el7_9.x86_64
perl-macros-5.16.3-299.el7_9.x86_64
perl-parent-0.225-244.el7.noarch
perl-podlators-2.5.1-3.el7.noarch
perl-srpm-macros-1-8.el7.noarch
perl-threads-1.87-4.el7.x86_64
perl-threads-shared-1.43-6.el7.x86_64
pinentry-0.8.1-17.el7.x86_64
pkgconfig-0.27.1-4.el7.x86_64
popt-1.13-16.el7.x86_64
procps-ng-3.3.10-28.el7.x86_64
pth-2.0.7-23.el7.x86_64
python-libs-2.7.5-94.el7_9.x86_64
python-rpm-macros-3-34.el7.noarch
python-srpm-macros-3-34.el7.noarch
python2-rpm-macros-3-34.el7.noarch
qrencode-libs-3.4.1-3.el7.x86_64
readline-6.2-11.el7.x86_64
redhat-release-server-7.9-12.el7_9.x86_64
redhat-rpm-config-9.1.0-88.el7.noarch
rpm-4.11.3-48.el7_9.x86_64
rpm-build-4.11.3-48.el7_9.x86_64
rpm-build-libs-4.11.3-48.el7_9.x86_64
rpm-libs-4.11.3-48.el7_9.x86_64
sed-4.2.2-7.el7.x86_64
setup-2.8.71-11.el7.noarch
shadow-utils-4.6-5.el7.x86_64
shared-mime-info-1.8-5.el7.x86_64
sqlite-libs-3.34.0-1.vdb.1.el7.x86_64
systemd-219-78.el7_9.9.x86_64
systemd-libs-219-78.el7_9.9.x86_64
tar-1.26-35.el7.x86_64
tzdata-2024a-1.el7.noarch
unzip-6.0-24.el7_9.x86_64
ustr-1.0.4-16.el7.x86_64
util-linux-2.23.2-65.el7_9.1.x86_64
which-2.20-7.el7.x86_64
xz-5.2.2-2.el7_9.x86_64
xz-libs-5.2.2-2.el7_9.x86_64
zip-3.0-11.el7.x86_64
zlib-1.2.7-21.el7_9.x86_64
Start: buildsrpm
Start: rpmbuild -bs
Building target platforms: x86_64
Building for target x86_64
Wrote: /builddir/build/SRPMS/ibus-stub-0.0.1-0.vdb.2.el7_9.src.rpm
Finish: rpmbuild -bs
Finish: buildsrpm
INFO: Done(/var/lib/copr-rpmbuild/workspace/workdir-u0rmh_2a/ibus-stub/ibus-stub.spec) Config(child) 1 minutes 40 seconds
INFO: Results and/or logs in: /var/lib/copr-rpmbuild/results
INFO: Cleaning up build root ('cleanup_on_success=True')
Start: clean chroot
INFO: unmounting tmpfs.
Finish: clean chroot
INFO: Start(/var/lib/copr-rpmbuild/results/ibus-stub-0.0.1-0.vdb.2.el7_9.src.rpm)  Config(rhel+epel-7-x86_64)
Start(bootstrap): chroot init
INFO: mounting tmpfs at /var/lib/mock/rhel+epel-7-x86_64-bootstrap-1740730960.966604/root.
INFO: reusing tmpfs at /var/lib/mock/rhel+epel-7-x86_64-bootstrap-1740730960.966604/root.
INFO: calling preinit hooks
INFO: enabled root cache
INFO: enabled package manager cache
Start(bootstrap): cleaning package manager metadata
Finish(bootstrap): cleaning package manager metadata
Finish(bootstrap): chroot init
Start: chroot init
INFO: mounting tmpfs at /var/lib/mock/rhel+epel-7-x86_64-1740730960.966604/root.
INFO: calling preinit hooks
INFO: enabled root cache
Start: unpacking root cache
Finish: unpacking root cache
INFO: enabled package manager cache
Start: cleaning package manager metadata
Finish: cleaning package manager metadata
INFO: enabled HW Info plugin
INFO: Buildroot is handled by package management downloaded with a bootstrap image:
  rpm-4.11.3-48.el7_9.x86_64
  yum-3.4.3-168.el7.noarch
  yum-utils-1.1.31-54.el7_8.noarch
Finish: chroot init
Start: build phase for ibus-stub-0.0.1-0.vdb.2.el7_9.src.rpm
Start: build setup for ibus-stub-0.0.1-0.vdb.2.el7_9.src.rpm
Building target platforms: x86_64
Building for target x86_64
Wrote: /builddir/build/SRPMS/ibus-stub-0.0.1-0.vdb.2.el7_9.src.rpm
Failed to set locale, defaulting to C
copr_base                                                | 2.1 kB     00:00     
copr_vandebugger_testing                                 | 2.1 kB     00:00     
epel                                                     | 4.3 kB     00:00     
rhel                                                     | 3.5 kB     00:00     
rhel-optional                                            | 3.2 kB     00:00     
epel/x86_64/updateinfo         FAILED                                          
http://mirror.fcix.net/fedora-archive/epel/7/x86_64/repodata/ee7ce72544e0fca006120c613404d937cc3da9d09c7d80aea269df31639f310c-updateinfo.xml.bz2: [Errno 14] HTTP Error 404 - Not Found
Trying other mirror.
To address this issue please refer to the below knowledge base article 

https://access.redhat.com/articles/1320623

If above article doesn't help to resolve this issue please open a ticket with Red Hat Support.

(1/3): epel/x86_64/group                                   | 399 kB   00:00     
(2/3): epel/x86_64/primary_db                              | 8.7 MB   00:00     
(3/3): epel/x86_64/updateinfo                              | 1.0 MB   00:00     
Getting requirements for ibus-stub-0.0.1-0.vdb.2.el7_9.src
No uninstalled build requires
Finish: build setup for ibus-stub-0.0.1-0.vdb.2.el7_9.src.rpm
Start: rpmbuild ibus-stub-0.0.1-0.vdb.2.el7_9.src.rpm
Building target platforms: x86_64
Building for target x86_64
Executing(%prep): /bin/sh -e /var/tmp/rpm-tmp.WHuq2I
+ umask 022
+ cd /builddir/build/BUILD
+ : ---------- PREP ---------- :
+ set -e
+ '[' -z '4.2.46(2)-release' ']'
+ set -o pipefail
+ exit 0
Executing(%build): /bin/sh -e /var/tmp/rpm-tmp.WVcxWx
+ umask 022
+ cd /builddir/build/BUILD
+ : ---------- BUILD ---------- :
+ set -e
+ '[' -z '4.2.46(2)-release' ']'
+ set -o pipefail
+ exit 0
Executing(%install): /bin/sh -e /var/tmp/rpm-tmp.abt3Qm
+ umask 022
+ cd /builddir/build/BUILD
+ '[' /builddir/build/BUILDROOT/ibus-stub-0.0.1-0.vdb.2.el7_9.x86_64 '!=' / ']'
+ rm -rf /builddir/build/BUILDROOT/ibus-stub-0.0.1-0.vdb.2.el7_9.x86_64
++ dirname /builddir/build/BUILDROOT/ibus-stub-0.0.1-0.vdb.2.el7_9.x86_64
+ mkdir -p /builddir/build/BUILDROOT
+ mkdir /builddir/build/BUILDROOT/ibus-stub-0.0.1-0.vdb.2.el7_9.x86_64
+ : ---------- INSTALL ---------- :
+ set -e
+ '[' -z '4.2.46(2)-release' ']'
+ set -o pipefail
+ /usr/bin/install -D /builddir/build/SOURCES/ibus-stub-README.md /builddir/build/BUILDROOT/ibus-stub-0.0.1-0.vdb.2.el7_9.x86_64//usr/share/doc/ibus-stub-0.0.1/README.md
+ /usr/lib/rpm/check-buildroot
+ /usr/lib/rpm/redhat/brp-compress
+ /usr/lib/rpm/redhat/brp-strip /usr/bin/strip
+ /usr/lib/rpm/redhat/brp-strip-comment-note /usr/bin/strip /usr/bin/objdump
+ /usr/lib/rpm/redhat/brp-strip-static-archive /usr/bin/strip
+ /usr/lib/rpm/brp-python-bytecompile /usr/bin/python 1
+ /usr/lib/rpm/redhat/brp-python-hardlink
+ /usr/lib/rpm/redhat/brp-java-repack-jars
Executing(%check): /bin/sh -e /var/tmp/rpm-tmp.AI64Vb
+ umask 022
+ cd /builddir/build/BUILD
+ : ---------- CHECK ---------- :
Processing files: ibus-stub-0.0.1-0.vdb.2.el7_9.x86_64
+ set -e
+ '[' -z '4.2.46(2)-release' ']'
+ set -o pipefail
+ exit 0
Provides: ibus ibus(x86-64) ibus-stub = 0.0.1-0.vdb.2.el7_9 ibus-stub(x86-64) = 0.0.1-0.vdb.2.el7_9
Requires(rpmlib): rpmlib(CompressedFileNames) <= 3.0.4-1 rpmlib(FileDigests) <= 4.6.0-1 rpmlib(PayloadFilesHavePrefix) <= 4.0-1
Conflicts: ibus ibus-gtk2 ibus-gtk3 ibus-gtk4
Checking for unpackaged file(s): /usr/lib/rpm/check-files /builddir/build/BUILDROOT/ibus-stub-0.0.1-0.vdb.2.el7_9.x86_64
Wrote: /builddir/build/RPMS/ibus-stub-0.0.1-0.vdb.2.el7_9.x86_64.rpm
Executing(%clean): /bin/sh -e /var/tmp/rpm-tmp.oxZAgQ
+ umask 022
+ cd /builddir/build/BUILD
+ /usr/bin/rm -rf /builddir/build/BUILDROOT/ibus-stub-0.0.1-0.vdb.2.el7_9.x86_64
+ exit 0
Finish: rpmbuild ibus-stub-0.0.1-0.vdb.2.el7_9.src.rpm
Finish: build phase for ibus-stub-0.0.1-0.vdb.2.el7_9.src.rpm
INFO: Done(/var/lib/copr-rpmbuild/results/ibus-stub-0.0.1-0.vdb.2.el7_9.src.rpm) Config(child) 0 minutes 6 seconds
INFO: Results and/or logs in: /var/lib/copr-rpmbuild/results
INFO: Cleaning up build root ('cleanup_on_success=True')
Start: clean chroot
INFO: unmounting tmpfs.
Finish: clean chroot
Finish: run
Running RPMResults tool
Package info:
{
    "packages": [
        {
            "name": "ibus-stub",
            "epoch": null,
            "version": "0.0.1",
            "release": "0.vdb.2.el7_9",
            "arch": "x86_64"
        },
        {
            "name": "ibus-stub",
            "epoch": null,
            "version": "0.0.1",
            "release": "0.vdb.2.el7_9",
            "arch": "src"
        }
    ]
}
RPMResults finished